Ticket #27: divine-build-log.txt

File divine-build-log.txt, 202.3 KB (added by Kamil Dudka, 9 months ago)

divine-build-log.txt

Line 
1[kdudka@f29 divine-4.1.20]$ make prerequisites   
2Fedora Modular 29 - x86_64                                                                                                                                   527 kB/s | 1.5 MB     00:02   
3Fedora Modular 29 - x86_64 - Updates                                                                                                                         2.0 MB/s | 1.8 MB     00:00   
4Fedora 29 - x86_64 - Updates                                                                                                                                  16 MB/s |  18 MB     00:01   
5Fedora 29 - x86_64                                                                                                                                            36 MB/s |  62 MB     00:01   
6============================================================================= Name Exactly Matched: ninja-build =============================================================================
7ninja-build.x86_64 : A small build system with a focus on speed
8./releng/install-prereq.sh: line 73: cmake: command not found
9+ yum install perl make cmake ninja-build python2 gcc-c++ libedit-devel ncurses-devel zlib-devel
10./releng/install-prereq.sh not running as root, will try to use sudo or su
11trying sudo, please enter your password if prompted
12Last metadata expiration check: 0:02:36 ago on Wed 19 Dec 2018 10:26:56 AM CET.
13Package make-1:4.2.1-10.fc29.x86_64 is already installed.
14Dependencies resolved.
15=============================================================================================================================================================================================
16 Package                                                  Arch                               Version                                               Repository                           Size
17=============================================================================================================================================================================================
18Installing:
19 gcc-c++                                                  x86_64                             8.2.1-6.fc29                                          updates                              12 M
20 perl                                                     x86_64                             4:5.28.1-427.fc29                                     updates                              20 k
21 python2                                                  x86_64                             2.7.15-11.fc29                                        updates                              46 k
22 cmake                                                    x86_64                             3.12.1-1.fc29                                         fedora                              7.8 M
23 libedit-devel                                            x86_64                             3.1-24.20170329cvs.fc29                               fedora                               39 k
24 ninja-build                                              x86_64                             1.8.2-5.fc29                                          fedora                              125 k
25 zlib-devel                                               x86_64                             1.2.11-14.fc29                                        fedora                               46 k
26Installing dependencies:
27 binutils                                                 x86_64                             2.31.1-15.fc29                                        updates                             6.0 M
28 cpp                                                      x86_64                             8.2.1-6.fc29                                          updates                              10 M
29 gcc                                                      x86_64                             8.2.1-6.fc29                                          updates                              23 M
30 glibc-devel                                              x86_64                             2.28-26.fc29                                          updates                             1.0 M
31 glibc-headers                                            x86_64                             2.28-26.fc29                                          updates                             464 k
32 kernel-headers                                           x86_64                             4.19.9-300.fc29                                       updates                             1.2 M
33 libstdc++-devel                                          x86_64                             8.2.1-6.fc29                                          updates                             2.1 M
34 libuv                                                    x86_64                             1:1.23.2-1.fc29                                       updates                             122 k
35 libxcrypt-devel                                          x86_64                             4.4.1-1.fc29                                          updates                              32 k
36 perl-Attribute-Handlers                                  noarch                             1.01-427.fc29                                         updates                              37 k
37 perl-DB_File                                             x86_64                             1.843-1.fc29                                          updates                              79 k
38 perl-Data-Dumper                                         x86_64                             2.173-1.fc29                                          updates                              54 k
39 perl-Devel-Peek                                          x86_64                             1.27-427.fc29                                         updates                              40 k
40 perl-Devel-SelfStubber                                   noarch                             1.06-427.fc29                                         updates                              23 k
41 perl-Errno                                               x86_64                             1.29-427.fc29                                         updates                              24 k
42 perl-ExtUtils-Embed                                      noarch                             1.35-427.fc29                                         updates                              27 k
43 perl-ExtUtils-Miniperl                                   noarch                             1.08-427.fc29                                         updates                              24 k
44 perl-ExtUtils-ParseXS                                    noarch                             1:3.39-418.fc29                                       updates                             188 k
45 perl-IO                                                  x86_64                             1.39-427.fc29                                         updates                              89 k
46 perl-IO-Zlib                                             noarch                             1:1.10-427.fc29                                       updates                              28 k
47 perl-Locale-Codes                                        noarch                             3.59-1.fc29                                           updates                             308 k
48 perl-Locale-Maketext-Simple                              noarch                             1:0.21-427.fc29                                       updates                              27 k
49 perl-Math-Complex                                        noarch                             1.59-427.fc29                                         updates                              56 k
50 perl-Memoize                                             noarch                             1.03-427.fc29                                         updates                              66 k
51 perl-Module-CoreList                                     noarch                             1:5.20181130-1.fc29                                   updates                              83 k
52 perl-Module-CoreList-tools                               noarch                             1:5.20181130-1.fc29                                   updates                              19 k
53 perl-Module-Loaded                                       noarch                             1:0.08-427.fc29                                       updates                              22 k
54 perl-Net-Ping                                            noarch                             2.62-427.fc29                                         updates                              49 k
55 perl-Pod-Html                                            noarch                             1.24-427.fc29                                         updates                              36 k
56 perl-SelfLoader                                          noarch                             1.25-427.fc29                                         updates                              31 k
57 perl-Test                                                noarch                             1.31-427.fc29                                         updates                              38 k
58 perl-Time-Piece                                          x86_64                             1.33-427.fc29                                         updates                              48 k
59 perl-bignum                                              noarch                             0.51-1.fc29                                           updates                              43 k
60 perl-devel                                               x86_64                             4:5.28.1-427.fc29                                     updates                             768 k
61 perl-interpreter                                         x86_64                             4:5.28.1-427.fc29                                     updates                             6.4 M
62 perl-libnetcfg                                           noarch                             4:5.28.1-427.fc29                                     updates                              26 k
63 perl-libs                                                x86_64                             4:5.28.1-427.fc29                                     updates                             1.6 M
64 perl-macros                                              x86_64                             4:5.28.1-427.fc29                                     updates                              20 k
65 perl-open                                                noarch                             1.11-427.fc29                                         updates                              25 k
66 perl-threads-shared                                      x86_64                             1.59-1.fc29                                           updates                              42 k
67 perl-utils                                               noarch                             5.28.1-427.fc29                                       updates                              77 k
68 python2-libs                                             x86_64                             2.7.15-11.fc29                                        updates                             6.1 M
69 systemtap-sdt-devel                                      x86_64                             4.0-2.fc29                                            updates                              68 k
70 unzip                                                    x86_64                             6.0-42.fc29                                           updates                             175 k
71 vim-filesystem                                           noarch                             2:8.1.575-1.fc29                                      updates                              31 k
72 annobin                                                  x86_64                             8.23-1.fc29                                           fedora                              122 k
73 cmake-data                                               noarch                             3.12.1-1.fc29                                         fedora                              1.3 M
74 cmake-filesystem                                         x86_64                             3.12.1-1.fc29                                         fedora                               16 k
75 cmake-rpm-macros                                         noarch                             3.12.1-1.fc29                                         fedora                               16 k
76 compat-openssl10                                         x86_64                             1:1.0.2o-3.fc29                                       fedora                              1.1 M
77 dwz                                                      x86_64                             0.12-9.fc29                                           fedora                              105 k
78 efi-srpm-macros                                          noarch                             3-3.fc29                                              fedora                               21 k
79 emacs-filesystem                                         noarch                             1:26.1-6.fc29                                         fedora                               10 k
80 fpc-srpm-macros                                          noarch                             1.1-5.fc29                                            fedora                              7.5 k
81 gdbm                                                     x86_64                             1:1.18-1.fc29                                         fedora                              116 k
82 ghc-srpm-macros                                          noarch                             1.4.2-8.fc29                                          fedora                              7.4 k
83 gnat-srpm-macros                                         noarch                             4-6.fc29                                              fedora                              8.2 k
84 go-srpm-macros                                           noarch                             2-18.fc29                                             fedora                               11 k
85 isl                                                      x86_64                             0.16.1-7.fc29                                         fedora                              841 k
86 jsoncpp                                                  x86_64                             1.8.4-5.fc29                                          fedora                               88 k
87 libmpc                                                   x86_64                             1.1.0-2.fc29                                          fedora                               58 k
88 libpkgconf                                               x86_64                             1.5.3-2.fc29                                          fedora                               35 k
89 ncurses-c++-libs                                         x86_64                             6.1-8.20180923.fc29                                   fedora                               32 k
90 ncurses-devel                                            x86_64                             6.1-8.20180923.fc29                                   fedora                              508 k
91 nim-srpm-macros                                          noarch                             1-3.fc29                                              fedora                              8.0 k
92 ocaml-srpm-macros                                        noarch                             5-4.fc29                                              fedora                              7.8 k
93 openblas-srpm-macros                                     noarch                             2-4.fc29                                              fedora                              7.2 k
94 perl-Algorithm-Diff                                      noarch                             1.1903-11.fc29                                        fedora                               48 k
95 perl-Archive-Tar                                         noarch                             2.30-418.fc29                                         fedora                               73 k
96 perl-Archive-Zip                                         noarch                             1.64-1.fc29                                           fedora                              102 k
97 perl-B-Debug                                             noarch                             1.26-418.fc29                                         fedora                               25 k
98 perl-CPAN                                                noarch                             2.20-418.fc29                                         fedora                              553 k
99 perl-CPAN-Meta                                           noarch                             2.150010-417.fc29                                     fedora                              182 k
100 perl-CPAN-Meta-Requirements                              noarch                             2.140-418.fc29                                        fedora                               32 k
101 perl-CPAN-Meta-YAML                                      noarch                             0.018-418.fc29                                        fedora                               26 k
102 perl-Carp                                                noarch                             1.50-417.fc29                                         fedora                               29 k
103 perl-Compress-Bzip2                                      x86_64                             2.26-9.fc29                                           fedora                               67 k
104 perl-Compress-Raw-Bzip2                                  x86_64                             2.081-5.fc29                                          fedora                               31 k
105 perl-Compress-Raw-Zlib                                   x86_64                             2.081-4.fc29                                          fedora                               59 k
106 perl-Config-Perl-V                                       noarch                             0.30-2.fc29                                           fedora                               21 k
107 perl-Data-OptList                                        noarch                             0.110-8.fc29                                          fedora                               26 k
108 perl-Data-Section                                        noarch                             0.200007-5.fc29                                       fedora                               25 k
109 perl-Devel-PPPort                                        x86_64                             3.42-3.fc29                                           fedora                              113 k
110 perl-Devel-Size                                          x86_64                             0.82-3.fc29                                           fedora                               30 k
111 perl-Digest                                              noarch                             1.17-417.fc29                                         fedora                               24 k
112 perl-Digest-MD5                                          x86_64                             2.55-417.fc29                                         fedora                               35 k
113 perl-Digest-SHA                                          x86_64                             1:6.02-4.fc29                                         fedora                               62 k
114 perl-Encode                                              x86_64                             4:2.98-6.fc29                                         fedora                              1.5 M
115 perl-Encode-devel                                        x86_64                             4:2.98-6.fc29                                         fedora                               34 k
116 perl-Env                                                 noarch                             1.04-417.fc29                                         fedora                               19 k
117 perl-Exporter                                            noarch                             5.73-418.fc29                                         fedora                               31 k
118 perl-ExtUtils-CBuilder                                   noarch                             1:0.280230-417.fc29                                   fedora                               47 k
119 perl-ExtUtils-Command                                    noarch                             1:7.34-418.fc29                                       fedora                               14 k
120 perl-ExtUtils-Install                                    noarch                             2.14-418.fc29                                         fedora                               45 k
121 perl-ExtUtils-MM-Utils                                   noarch                             1:7.34-418.fc29                                       fedora                               12 k
122 perl-ExtUtils-MakeMaker                                  noarch                             1:7.34-418.fc29                                       fedora                              296 k
123 perl-ExtUtils-Manifest                                   noarch                             1:1.71-3.fc29                                         fedora                               34 k
124 perl-File-Fetch                                          noarch                             0.56-417.fc29                                         fedora                               31 k
125 perl-File-HomeDir                                        noarch                             1.004-3.fc29                                          fedora                               57 k
126 perl-File-Path                                           noarch                             2.16-1.fc29                                           fedora                               36 k
127 perl-File-Temp                                           noarch                             1:0.230.800-2.fc29                                    fedora                               60 k
128 perl-File-Which                                          noarch                             1.22-4.fc29                                           fedora                               19 k
129 perl-Filter                                              x86_64                             2:1.59-1.fc29                                         fedora                               78 k
130 perl-Filter-Simple                                       noarch                             0.95-417.fc29                                         fedora                               27 k
131 perl-Getopt-Long                                         noarch                             1:2.50-417.fc29                                       fedora                               61 k
132 perl-HTTP-Tiny                                           noarch                             0.076-1.fc29                                          fedora                               55 k
133 perl-IO-Compress                                         noarch                             2.081-5.fc29                                          fedora                              247 k
134 perl-IO-Socket-IP                                        noarch                             0.39-418.fc29                                         fedora                               42 k
135 perl-IPC-Cmd                                             noarch                             2:1.02-4.fc29                                         fedora                               41 k
136 perl-IPC-SysV                                            x86_64                             2.07-418.fc29                                         fedora                               42 k
137 perl-IPC-System-Simple                                   noarch                             1.25-20.fc29                                          fedora                               39 k
138 perl-JSON-PP                                             noarch                             1:2.97.001-418.fc29                                   fedora                               63 k
139 perl-Locale-Maketext                                     noarch                             1.29-418.fc29                                         fedora                               96 k
140 perl-MIME-Base64                                         x86_64                             3.15-417.fc29                                         fedora                               30 k
141 perl-MRO-Compat                                          noarch                             0.13-6.fc29                                           fedora                               19 k
142 perl-Math-BigInt                                         noarch                             1:1.9998.13-3.fc29                                    fedora                              194 k
143 perl-Math-BigInt-FastCalc                                x86_64                             0.500.700-3.fc29                                      fedora                               26 k
144 perl-Math-BigRat                                         noarch                             0.2614-3.fc29                                         fedora                               39 k
145 perl-Module-Build                                        noarch                             2:0.42.24-10.fc29                                     fedora                              268 k
146 perl-Module-Load                                         noarch                             1:0.32-417.fc29                                       fedora                               16 k
147 perl-Module-Load-Conditional                             noarch                             0.68-417.fc29                                         fedora                               22 k
148 perl-Module-Metadata                                     noarch                             1.000033-417.fc29                                     fedora                               35 k
149 perl-Net-SSLeay                                          x86_64                             1.85-8.fc29                                           fedora                              325 k
150 perl-Package-Generator                                   noarch                             1.106-13.fc29                                         fedora                               23 k
151 perl-Params-Check                                        noarch                             1:0.38-417.fc29                                       fedora                               22 k
152 perl-Params-Util                                         x86_64                             1.07-25.fc29                                          fedora                               37 k
153 perl-PathTools                                           x86_64                             3.75-1.fc29                                           fedora                               85 k
154 perl-Perl-OSType                                         noarch                             1.010-418.fc29                                        fedora                               23 k
155 perl-PerlIO-via-QuotedPrint                              noarch                             0.08-417.fc29                                         fedora                               12 k
156 perl-Pod-Checker                                         noarch                             4:1.73-417.fc29                                       fedora                               31 k
157 perl-Pod-Escapes                                         noarch                             1:1.07-417.fc29                                       fedora                               19 k
158 perl-Pod-Parser                                          noarch                             1.63-418.fc29                                         fedora                              105 k
159 perl-Pod-Perldoc                                         noarch                             3.28.01-418.fc29                                      fedora                               83 k
160 perl-Pod-Simple                                          noarch                             1:3.35-417.fc29                                       fedora                              211 k
161 perl-Pod-Usage                                           noarch                             4:1.69-417.fc29                                       fedora                               32 k
162 perl-Scalar-List-Utils                                   x86_64                             3:1.50-417.fc29                                       fedora                               64 k
163 perl-Socket                                              x86_64                             4:2.027-417.fc29                                      fedora                               54 k
164 perl-Software-License                                    noarch                             0.103013-5.fc29                                       fedora                              131 k
165 perl-Storable                                            x86_64                             1:3.11-5.fc29                                         fedora                               94 k
166 perl-Sub-Exporter                                        noarch                             0.987-17.fc29                                         fedora                               68 k
167 perl-Sub-Install                                         noarch                             0.928-17.fc29                                         fedora                               22 k
168 perl-Sys-Syslog                                          x86_64                             0.35-418.fc29                                         fedora                               47 k
169 perl-Term-ANSIColor                                      noarch                             4.06-418.fc29                                         fedora                               44 k
170 perl-Term-Cap                                            noarch                             1.17-417.fc29                                         fedora                               22 k
171 perl-Test-Harness                                        noarch                             1:3.42-418.fc29                                       fedora                              276 k
172 perl-Test-Simple                                         noarch                             2:1.302140-1.fc29                                     fedora                              509 k
173 perl-Text-Balanced                                       noarch                             2.03-417.fc29                                         fedora                               57 k
174 perl-Text-Diff                                           noarch                             1.45-4.fc29                                           fedora                               41 k
175 perl-Text-Glob                                           noarch                             0.11-6.fc29                                           fedora                               13 k
176 perl-Text-ParseWords                                     noarch                             3.30-417.fc29                                         fedora                               16 k
177 perl-Text-Tabs+Wrap                                      noarch                             2013.0523-417.fc29                                    fedora                               23 k
178 perl-Text-Template                                       noarch                             1.53-3.fc29                                           fedora                               61 k
179 perl-Thread-Queue                                        noarch                             3.13-1.fc29                                           fedora                               21 k
180 perl-Time-HiRes                                          x86_64                             1.9759-417.fc29                                       fedora                               57 k
181 perl-Time-Local                                          noarch                             2:1.280-3.fc29                                        fedora                               31 k
182 perl-URI                                                 noarch                             1.74-4.fc29                                           fedora                              109 k
183 perl-Unicode-Collate                                     x86_64                             1.25-417.fc29                                         fedora                              688 k
184 perl-Unicode-Normalize                                   x86_64                             1.26-417.fc29                                         fedora                               81 k
185 perl-autodie                                             noarch                             2.29-418.fc29                                         fedora                               95 k
186 perl-constant                                            noarch                             1.33-418.fc29                                         fedora                               23 k
187 perl-encoding                                            x86_64                             4:2.22-6.fc29                                         fedora                               63 k
188 perl-experimental                                        noarch                             0.020-3.fc29                                          fedora                               21 k
189 perl-inc-latest                                          noarch                             2:0.500-11.fc29                                       fedora                               24 k
190 perl-libnet                                              noarch                             3.11-418.fc29                                         fedora                              120 k
191 perl-local-lib                                           noarch                             2.000024-4.fc29                                       fedora                               68 k
192 perl-parent                                              noarch                             1:0.237-2.fc29                                        fedora                               14 k
193 perl-perlfaq                                             noarch                             5.20180915-1.fc29                                     fedora                              385 k
194 perl-podlators                                           noarch                             1:4.11-3.fc29                                         fedora                              115 k
195 perl-srpm-macros                                         noarch                             1-28.fc29                                             fedora                              8.1 k
196 perl-threads                                             x86_64                             1:2.22-417.fc29                                       fedora                               57 k
197 perl-version                                             x86_64                             7:0.99.24-5.fc29                                      fedora                               63 k
198 pkgconf                                                  x86_64                             1.5.3-2.fc29                                          fedora                               39 k
199 pkgconf-m4                                               noarch                             1.5.3-2.fc29                                          fedora                               17 k
200 pkgconf-pkg-config                                       x86_64                             1.5.3-2.fc29                                          fedora                               15 k
201 python-srpm-macros                                       noarch                             3-37.fc29                                             fedora                               11 k
202 python3-pyparsing                                        noarch                             2.2.0-3.fc29                                          fedora                              138 k
203 qt5-srpm-macros                                          noarch                             5.11.1-4.fc29                                         fedora                              9.4 k
204 redhat-rpm-config                                        noarch                             118-1.fc29                                            fedora                               58 k
205 rhash                                                    x86_64                             1.3.5-3.fc29                                          fedora                              129 k
206 rust-srpm-macros                                         noarch                             6-1.fc29                                              fedora                              8.4 k
207 zip                                                      x86_64                             3.0-23.fc29                                           fedora                              264 k
208Installing weak dependencies:
209 python-unversioned-command                               noarch                             2.7.15-11.fc29                                        updates                              13 k
210 python2-pip                                              noarch                             18.1-1.fc29                                           updates                             1.9 M
211 perl-Encode-Locale                                       noarch                             1.05-11.fc29                                          fedora                               19 k
212 perl-IO-Socket-SSL                                       noarch                             2.060-2.fc29                                          fedora                              237 k
213 perl-Mozilla-CA                                          noarch                             20180117-3.fc29                                       fedora                               12 k
214 perl-TermReadKey                                         x86_64                             2.37-9.fc29                                           fedora                               35 k
215 python2-setuptools                                       noarch                             40.4.3-1.fc29                                         fedora                              631 k
216
217Transaction Summary
218=============================================================================================================================================================================================
219Install  195 Packages
220
221Total download size: 98 M
222Installed size: 302 M
223Is this ok [y/N]: y         
224Downloading Packages:
225(1/195): binutils-2.31.1-15.fc29.x86_64.rpm                                                                                                                  5.0 MB/s | 6.0 MB     00:01   
226(2/195): cpp-8.2.1-6.fc29.x86_64.rpm                                                                                                                         7.9 MB/s |  10 MB     00:01   
227(3/195): glibc-devel-2.28-26.fc29.x86_64.rpm                                                                                                                  37 MB/s | 1.0 MB     00:00   
228(4/195): glibc-headers-2.28-26.fc29.x86_64.rpm                                                                                                                32 MB/s | 464 kB     00:00   
229(5/195): kernel-headers-4.19.9-300.fc29.x86_64.rpm                                                                                                            32 MB/s | 1.2 MB     00:00   
230(6/195): libstdc++-devel-8.2.1-6.fc29.x86_64.rpm                                                                                                              34 MB/s | 2.1 MB     00:00   
231(7/195): libuv-1.23.2-1.fc29.x86_64.rpm                                                                                                                       12 MB/s | 122 kB     00:00   
232(8/195): libxcrypt-devel-4.4.1-1.fc29.x86_64.rpm                                                                                                             3.9 MB/s |  32 kB     00:00   
233(9/195): perl-5.28.1-427.fc29.x86_64.rpm                                                                                                                     2.5 MB/s |  20 kB     00:00   
234(10/195): perl-Attribute-Handlers-1.01-427.fc29.noarch.rpm                                                                                                   4.5 MB/s |  37 kB     00:00   
235(11/195): perl-DB_File-1.843-1.fc29.x86_64.rpm                                                                                                               7.7 MB/s |  79 kB     00:00   
236(12/195): perl-Data-Dumper-2.173-1.fc29.x86_64.rpm                                                                                                           5.9 MB/s |  54 kB     00:00   
237(13/195): perl-Devel-Peek-1.27-427.fc29.x86_64.rpm                                                                                                           4.4 MB/s |  40 kB     00:00   
238(14/195): perl-Devel-SelfStubber-1.06-427.fc29.noarch.rpm                                                                                                    2.5 MB/s |  23 kB     00:00   
239(15/195): perl-Errno-1.29-427.fc29.x86_64.rpm                                                                                                                2.6 MB/s |  24 kB     00:00   
240(16/195): perl-ExtUtils-Embed-1.35-427.fc29.noarch.rpm                                                                                                       2.9 MB/s |  27 kB     00:00   
241(17/195): perl-ExtUtils-Miniperl-1.08-427.fc29.noarch.rpm                                                                                                    2.4 MB/s |  24 kB     00:00   
242(18/195): gcc-c++-8.2.1-6.fc29.x86_64.rpm                                                                                                                     34 MB/s |  12 MB     00:00   
243(19/195): perl-IO-1.39-427.fc29.x86_64.rpm                                                                                                                    14 MB/s |  89 kB     00:00   
244(20/195): perl-IO-Zlib-1.10-427.fc29.noarch.rpm                                                                                                              5.5 MB/s |  28 kB     00:00   
245(21/195): gcc-8.2.1-6.fc29.x86_64.rpm                                                                                                                         14 MB/s |  23 MB     00:01   
246(22/195): perl-Locale-Codes-3.59-1.fc29.noarch.rpm                                                                                                           4.2 MB/s | 308 kB     00:00   
247(23/195): perl-Locale-Maketext-Simple-0.21-427.fc29.noarch.rpm                                                                                               3.3 MB/s |  27 kB     00:00   
248(24/195): perl-Math-Complex-1.59-427.fc29.noarch.rpm                                                                                                         9.2 MB/s |  56 kB     00:00   
249(25/195): perl-Memoize-1.03-427.fc29.noarch.rpm                                                                                                              9.3 MB/s |  66 kB     00:00   
250(26/195): perl-Module-CoreList-5.20181130-1.fc29.noarch.rpm                                                                                                   14 MB/s |  83 kB     00:00   
251(27/195): perl-Module-CoreList-tools-5.20181130-1.fc29.noarch.rpm                                                                                            3.7 MB/s |  19 kB     00:00   
252(28/195): perl-Module-Loaded-0.08-427.fc29.noarch.rpm                                                                                                        4.4 MB/s |  22 kB     00:00   
253(29/195): perl-Net-Ping-2.62-427.fc29.noarch.rpm                                                                                                             8.0 MB/s |  49 kB     00:00   
254(30/195): perl-Pod-Html-1.24-427.fc29.noarch.rpm                                                                                                             5.8 MB/s |  36 kB     00:00   
255(31/195): perl-SelfLoader-1.25-427.fc29.noarch.rpm                                                                                                           4.3 MB/s |  31 kB     00:00   
256(32/195): perl-Test-1.31-427.fc29.noarch.rpm                                                                                                                 6.1 MB/s |  38 kB     00:00   
257(33/195): perl-Time-Piece-1.33-427.fc29.x86_64.rpm                                                                                                           6.8 MB/s |  48 kB     00:00   
258(34/195): perl-bignum-0.51-1.fc29.noarch.rpm                                                                                                                 6.0 MB/s |  43 kB     00:00   
259(35/195): perl-devel-5.28.1-427.fc29.x86_64.rpm                                                                                                               54 MB/s | 768 kB     00:00   
260(36/195): perl-libnetcfg-5.28.1-427.fc29.noarch.rpm                                                                                                          5.0 MB/s |  26 kB     00:00   
261(37/195): perl-libs-5.28.1-427.fc29.x86_64.rpm                                                                                                                46 MB/s | 1.6 MB     00:00   
262(38/195): perl-macros-5.28.1-427.fc29.x86_64.rpm                                                                                                             4.9 MB/s |  20 kB     00:00   
263(39/195): perl-open-1.11-427.fc29.noarch.rpm                                                                                                                 6.2 MB/s |  25 kB     00:00   
264(40/195): perl-threads-shared-1.59-1.fc29.x86_64.rpm                                                                                                          10 MB/s |  42 kB     00:00   
265(41/195): perl-utils-5.28.1-427.fc29.noarch.rpm                                                                                                               13 MB/s |  77 kB     00:00   
266(42/195): python-unversioned-command-2.7.15-11.fc29.noarch.rpm                                                                                               3.2 MB/s |  13 kB     00:00   
267(43/195): python2-2.7.15-11.fc29.x86_64.rpm                                                                                                                   11 MB/s |  46 kB     00:00   
268(44/195): perl-interpreter-5.28.1-427.fc29.x86_64.rpm                                                                                                         61 MB/s | 6.4 MB     00:00   
269(45/195): perl-ExtUtils-ParseXS-3.39-418.fc29.noarch.rpm                                                                                                     634 kB/s | 188 kB     00:00   
270(46/195): systemtap-sdt-devel-4.0-2.fc29.x86_64.rpm                                                                                                          4.8 MB/s |  68 kB     00:00   
271(47/195): python2-pip-18.1-1.fc29.noarch.rpm                                                                                                                  39 MB/s | 1.9 MB     00:00   
272(48/195): unzip-6.0-42.fc29.x86_64.rpm                                                                                                                       8.5 MB/s | 175 kB     00:00   
273(49/195): vim-filesystem-8.1.575-1.fc29.noarch.rpm                                                                                                           6.1 MB/s |  31 kB     00:00   
274(50/195): annobin-8.23-1.fc29.x86_64.rpm                                                                                                                      17 MB/s | 122 kB     00:00   
275(51/195): python2-libs-2.7.15-11.fc29.x86_64.rpm                                                                                                              45 MB/s | 6.1 MB     00:00   
276(52/195): cmake-data-3.12.1-1.fc29.noarch.rpm                                                                                                                 21 MB/s | 1.3 MB     00:00   
277(53/195): cmake-filesystem-3.12.1-1.fc29.x86_64.rpm                                                                                                          2.7 MB/s |  16 kB     00:00   
278(54/195): cmake-rpm-macros-3.12.1-1.fc29.noarch.rpm                                                                                                          3.0 MB/s |  16 kB     00:00   
279(55/195): dwz-0.12-9.fc29.x86_64.rpm                                                                                                                         8.6 MB/s | 105 kB     00:00   
280(56/195): compat-openssl10-1.0.2o-3.fc29.x86_64.rpm                                                                                                           40 MB/s | 1.1 MB     00:00   
281(57/195): efi-srpm-macros-3-3.fc29.noarch.rpm                                                                                                                1.7 MB/s |  21 kB     00:00   
282(58/195): emacs-filesystem-26.1-6.fc29.noarch.rpm                                                                                                            2.5 MB/s |  10 kB     00:00   
283(59/195): fpc-srpm-macros-1.1-5.fc29.noarch.rpm                                                                                                              1.8 MB/s | 7.5 kB     00:00   
284(60/195): ghc-srpm-macros-1.4.2-8.fc29.noarch.rpm                                                                                                            1.5 MB/s | 7.4 kB     00:00   
285(61/195): gdbm-1.18-1.fc29.x86_64.rpm                                                                                                                         16 MB/s | 116 kB     00:00   
286(62/195): gnat-srpm-macros-4-6.fc29.noarch.rpm                                                                                                               1.6 MB/s | 8.2 kB     00:00   
287(63/195): go-srpm-macros-2-18.fc29.noarch.rpm                                                                                                                2.1 MB/s |  11 kB     00:00   
288(64/195): jsoncpp-1.8.4-5.fc29.x86_64.rpm                                                                                                                     11 MB/s |  88 kB     00:00   
289(65/195): isl-0.16.1-7.fc29.x86_64.rpm                                                                                                                        37 MB/s | 841 kB     00:00   
290(66/195): libmpc-1.1.0-2.fc29.x86_64.rpm                                                                                                                     9.4 MB/s |  58 kB     00:00   
291(67/195): libedit-devel-3.1-24.20170329cvs.fc29.x86_64.rpm                                                                                                   2.0 MB/s |  39 kB     00:00   
292(68/195): cmake-3.12.1-1.fc29.x86_64.rpm                                                                                                                      47 MB/s | 7.8 MB     00:00   
293(69/195): libpkgconf-1.5.3-2.fc29.x86_64.rpm                                                                                                                 1.3 MB/s |  35 kB     00:00   
294(70/195): ncurses-c++-libs-6.1-8.20180923.fc29.x86_64.rpm                                                                                                    1.1 MB/s |  32 kB     00:00   
295(71/195): nim-srpm-macros-1-3.fc29.noarch.rpm                                                                                                                442 kB/s | 8.0 kB     00:00   
296(72/195): ninja-build-1.8.2-5.fc29.x86_64.rpm                                                                                                                6.4 MB/s | 125 kB     00:00   
297(73/195): ocaml-srpm-macros-5-4.fc29.noarch.rpm                                                                                                              1.9 MB/s | 7.8 kB     00:00   
298(74/195): openblas-srpm-macros-2-4.fc29.noarch.rpm                                                                                                           3.5 MB/s | 7.2 kB     00:00   
299(75/195): perl-Algorithm-Diff-1.1903-11.fc29.noarch.rpm                                                                                                       12 MB/s |  48 kB     00:00   
300(76/195): ncurses-devel-6.1-8.20180923.fc29.x86_64.rpm                                                                                                        15 MB/s | 508 kB     00:00   
301(77/195): perl-Archive-Tar-2.30-418.fc29.noarch.rpm                                                                                                           10 MB/s |  73 kB     00:00   
302(78/195): perl-Archive-Zip-1.64-1.fc29.noarch.rpm                                                                                                             10 MB/s | 102 kB     00:00   
303(79/195): perl-B-Debug-1.26-418.fc29.noarch.rpm                                                                                                              4.8 MB/s |  25 kB     00:00   
304(80/195): perl-CPAN-Meta-Requirements-2.140-418.fc29.noarch.rpm                                                                                               10 MB/s |  32 kB     00:00   
305(81/195): perl-CPAN-Meta-2.150010-417.fc29.noarch.rpm                                                                                                         25 MB/s | 182 kB     00:00   
306(82/195): perl-CPAN-2.20-418.fc29.noarch.rpm                                                                                                                  45 MB/s | 553 kB     00:00   
307(83/195): perl-CPAN-Meta-YAML-0.018-418.fc29.noarch.rpm                                                                                                      5.1 MB/s |  26 kB     00:00   
308(84/195): perl-Carp-1.50-417.fc29.noarch.rpm                                                                                                                 5.7 MB/s |  29 kB     00:00   
309(85/195): perl-Compress-Bzip2-2.26-9.fc29.x86_64.rpm                                                                                                          16 MB/s |  67 kB     00:00   
310(86/195): perl-Compress-Raw-Bzip2-2.081-5.fc29.x86_64.rpm                                                                                                    7.7 MB/s |  31 kB     00:00   
311(87/195): perl-Config-Perl-V-0.30-2.fc29.noarch.rpm                                                                                                           10 MB/s |  21 kB     00:00   
312(88/195): perl-Compress-Raw-Zlib-2.081-4.fc29.x86_64.rpm                                                                                                     9.5 MB/s |  59 kB     00:00   
313(89/195): perl-Data-OptList-0.110-8.fc29.noarch.rpm                                                                                                          3.6 MB/s |  26 kB     00:00   
314(90/195): perl-Data-Section-0.200007-5.fc29.noarch.rpm                                                                                                       4.0 MB/s |  25 kB     00:00   
315(91/195): perl-Devel-PPPort-3.42-3.fc29.x86_64.rpm                                                                                                            14 MB/s | 113 kB     00:00   
316(92/195): perl-Devel-Size-0.82-3.fc29.x86_64.rpm                                                                                                             4.9 MB/s |  30 kB     00:00   
317(93/195): perl-Digest-1.17-417.fc29.noarch.rpm                                                                                                               3.4 MB/s |  24 kB     00:00   
318(94/195): perl-Digest-MD5-2.55-417.fc29.x86_64.rpm                                                                                                           2.8 MB/s |  35 kB     00:00   
319(95/195): perl-Digest-SHA-6.02-4.fc29.x86_64.rpm                                                                                                             7.6 MB/s |  62 kB     00:00   
320(96/195): perl-Encode-Locale-1.05-11.fc29.noarch.rpm                                                                                                         6.0 MB/s |  19 kB     00:00   
321(97/195): perl-Encode-devel-2.98-6.fc29.x86_64.rpm                                                                                                           8.3 MB/s |  34 kB     00:00   
322(98/195): perl-Env-1.04-417.fc29.noarch.rpm                                                                                                                  6.3 MB/s |  19 kB     00:00   
323(99/195): perl-Exporter-5.73-418.fc29.noarch.rpm                                                                                                              10 MB/s |  31 kB     00:00   
324(100/195): perl-ExtUtils-CBuilder-0.280230-417.fc29.noarch.rpm                                                                                                11 MB/s |  47 kB     00:00   
325(101/195): perl-ExtUtils-Command-7.34-418.fc29.noarch.rpm                                                                                                    3.5 MB/s |  14 kB     00:00   
326(102/195): perl-ExtUtils-Install-2.14-418.fc29.noarch.rpm                                                                                                     15 MB/s |  45 kB     00:00   
327(103/195): perl-ExtUtils-MM-Utils-7.34-418.fc29.noarch.rpm                                                                                                   3.8 MB/s |  12 kB     00:00   
328(104/195): perl-Encode-2.98-6.fc29.x86_64.rpm                                                                                                                 49 MB/s | 1.5 MB     00:00   
329(105/195): perl-ExtUtils-Manifest-1.71-3.fc29.noarch.rpm                                                                                                     4.2 MB/s |  34 kB     00:00   
330(106/195): perl-ExtUtils-MakeMaker-7.34-418.fc29.noarch.rpm                                                                                                   26 MB/s | 296 kB     00:00   
331(107/195): perl-File-Fetch-0.56-417.fc29.noarch.rpm                                                                                                          7.5 MB/s |  31 kB     00:00   
332(108/195): perl-File-HomeDir-1.004-3.fc29.noarch.rpm                                                                                                         9.4 MB/s |  57 kB     00:00   
333(109/195): perl-File-Path-2.16-1.fc29.noarch.rpm                                                                                                             8.7 MB/s |  36 kB     00:00   
334(110/195): perl-File-Temp-0.230.800-2.fc29.noarch.rpm                                                                                                         12 MB/s |  60 kB     00:00   
335(111/195): perl-File-Which-1.22-4.fc29.noarch.rpm                                                                                                            6.2 MB/s |  19 kB     00:00   
336(112/195): perl-Filter-1.59-1.fc29.x86_64.rpm                                                                                                                 15 MB/s |  78 kB     00:00   
337(113/195): perl-Filter-Simple-0.95-417.fc29.noarch.rpm                                                                                                       5.3 MB/s |  27 kB     00:00   
338(114/195): perl-Getopt-Long-2.50-417.fc29.noarch.rpm                                                                                                          15 MB/s |  61 kB     00:00   
339(115/195): perl-HTTP-Tiny-0.076-1.fc29.noarch.rpm                                                                                                            9.0 MB/s |  55 kB     00:00   
340(116/195): perl-IO-Socket-IP-0.39-418.fc29.noarch.rpm                                                                                                         10 MB/s |  42 kB     00:00   
341(117/195): perl-IO-Compress-2.081-5.fc29.noarch.rpm                                                                                                           34 MB/s | 247 kB     00:00   
342(118/195): perl-IO-Socket-SSL-2.060-2.fc29.noarch.rpm                                                                                                         39 MB/s | 237 kB     00:00   
343(119/195): perl-IPC-Cmd-1.02-4.fc29.noarch.rpm                                                                                                               9.9 MB/s |  41 kB     00:00   
344(120/195): perl-IPC-SysV-2.07-418.fc29.x86_64.rpm                                                                                                            8.1 MB/s |  42 kB     00:00   
345(121/195): perl-IPC-System-Simple-1.25-20.fc29.noarch.rpm                                                                                                     13 MB/s |  39 kB     00:00   
346(122/195): perl-JSON-PP-2.97.001-418.fc29.noarch.rpm                                                                                                         8.8 MB/s |  63 kB     00:00   
347(123/195): perl-MIME-Base64-3.15-417.fc29.x86_64.rpm                                                                                                         7.2 MB/s |  30 kB     00:00   
348(124/195): perl-Locale-Maketext-1.29-418.fc29.noarch.rpm                                                                                                      13 MB/s |  96 kB     00:00   
349(125/195): perl-MRO-Compat-0.13-6.fc29.noarch.rpm                                                                                                            4.8 MB/s |  19 kB     00:00   
350(126/195): perl-Math-BigInt-1.9998.13-3.fc29.noarch.rpm                                                                                                       38 MB/s | 194 kB     00:00   
351(127/195): perl-Math-BigInt-FastCalc-0.500.700-3.fc29.x86_64.rpm                                                                                             6.4 MB/s |  26 kB     00:00   
352(128/195): perl-Math-BigRat-0.2614-3.fc29.noarch.rpm                                                                                                         6.4 MB/s |  39 kB     00:00   
353(129/195): perl-Module-Load-0.32-417.fc29.noarch.rpm                                                                                                         5.3 MB/s |  16 kB     00:00   
354(130/195): perl-Module-Build-0.42.24-10.fc29.noarch.rpm                                                                                                       37 MB/s | 268 kB     00:00   
355(131/195): perl-Module-Load-Conditional-0.68-417.fc29.noarch.rpm                                                                                             4.3 MB/s |  22 kB     00:00   
356(132/195): perl-Module-Metadata-1.000033-417.fc29.noarch.rpm                                                                                                 5.8 MB/s |  35 kB     00:00   
357(133/195): perl-Mozilla-CA-20180117-3.fc29.noarch.rpm                                                                                                        3.9 MB/s |  12 kB     00:00   
358(134/195): perl-Net-SSLeay-1.85-8.fc29.x86_64.rpm                                                                                                             45 MB/s | 325 kB     00:00   
359(135/195): perl-Package-Generator-1.106-13.fc29.noarch.rpm                                                                                                   4.4 MB/s |  23 kB     00:00   
360(136/195): perl-Params-Check-0.38-417.fc29.noarch.rpm                                                                                                        3.0 MB/s |  22 kB     00:00   
361(137/195): perl-Params-Util-1.07-25.fc29.x86_64.rpm                                                                                                          9.2 MB/s |  37 kB     00:00   
362(138/195): perl-PathTools-3.75-1.fc29.x86_64.rpm                                                                                                              17 MB/s |  85 kB     00:00   
363(139/195): perl-PerlIO-via-QuotedPrint-0.08-417.fc29.noarch.rpm                                                                                              3.0 MB/s |  12 kB     00:00   
364(140/195): perl-Perl-OSType-1.010-418.fc29.noarch.rpm                                                                                                        4.5 MB/s |  23 kB     00:00   
365(141/195): perl-Pod-Checker-1.73-417.fc29.noarch.rpm                                                                                                          10 MB/s |  31 kB     00:00   
366(142/195): perl-Pod-Escapes-1.07-417.fc29.noarch.rpm                                                                                                         6.3 MB/s |  19 kB     00:00   
367(143/195): perl-Pod-Parser-1.63-418.fc29.noarch.rpm                                                                                                           17 MB/s | 105 kB     00:00   
368(144/195): perl-Pod-Perldoc-3.28.01-418.fc29.noarch.rpm                                                                                                       16 MB/s |  83 kB     00:00   
369(145/195): perl-Pod-Simple-3.35-417.fc29.noarch.rpm                                                                                                           29 MB/s | 211 kB     00:00   
370(146/195): perl-Pod-Usage-1.69-417.fc29.noarch.rpm                                                                                                           6.2 MB/s |  32 kB     00:00   
371(147/195): perl-Scalar-List-Utils-1.50-417.fc29.x86_64.rpm                                                                                                    10 MB/s |  64 kB     00:00   
372(148/195): perl-Socket-2.027-417.fc29.x86_64.rpm                                                                                                              10 MB/s |  54 kB     00:00   
373(149/195): perl-Software-License-0.103013-5.fc29.noarch.rpm                                                                                                   21 MB/s | 131 kB     00:00   
374(150/195): perl-Sub-Exporter-0.987-17.fc29.noarch.rpm                                                                                                         22 MB/s |  68 kB     00:00   
375(151/195): perl-Storable-3.11-5.fc29.x86_64.rpm                                                                                                               11 MB/s |  94 kB     00:00   
376(152/195): perl-Sub-Install-0.928-17.fc29.noarch.rpm                                                                                                         7.2 MB/s |  22 kB     00:00   
377(153/195): perl-Sys-Syslog-0.35-418.fc29.x86_64.rpm                                                                                                          9.3 MB/s |  47 kB     00:00   
378(154/195): perl-Term-Cap-1.17-417.fc29.noarch.rpm                                                                                                            7.0 MB/s |  22 kB     00:00   
379(155/195): perl-Term-ANSIColor-4.06-418.fc29.noarch.rpm                                                                                                      7.2 MB/s |  44 kB     00:00   
380(156/195): perl-TermReadKey-2.37-9.fc29.x86_64.rpm                                                                                                           6.8 MB/s |  35 kB     00:00   
381(157/195): perl-Test-Harness-3.42-418.fc29.noarch.rpm                                                                                                         39 MB/s | 276 kB     00:00   
382(158/195): perl-Text-Balanced-2.03-417.fc29.noarch.rpm                                                                                                        11 MB/s |  57 kB     00:00   
383(159/195): perl-Test-Simple-1.302140-1.fc29.noarch.rpm                                                                                                        45 MB/s | 509 kB     00:00   
384(160/195): perl-Text-Glob-0.11-6.fc29.noarch.rpm                                                                                                             2.6 MB/s |  13 kB     00:00   
385(161/195): perl-Text-Diff-1.45-4.fc29.noarch.rpm                                                                                                             4.5 MB/s |  41 kB     00:00   
386(162/195): perl-Text-ParseWords-3.30-417.fc29.noarch.rpm                                                                                                     5.1 MB/s |  16 kB     00:00   
387(163/195): perl-Text-Tabs+Wrap-2013.0523-417.fc29.noarch.rpm                                                                                                 3.7 MB/s |  23 kB     00:00   
388(164/195): perl-Thread-Queue-3.13-1.fc29.noarch.rpm                                                                                                          5.2 MB/s |  21 kB     00:00   
389(165/195): perl-Text-Template-1.53-3.fc29.noarch.rpm                                                                                                         7.4 MB/s |  61 kB     00:00   
390(166/195): perl-Time-Local-1.280-3.fc29.noarch.rpm                                                                                                           7.7 MB/s |  31 kB     00:00   
391(167/195): perl-Time-HiRes-1.9759-417.fc29.x86_64.rpm                                                                                                        8.0 MB/s |  57 kB     00:00   
392(168/195): perl-URI-1.74-4.fc29.noarch.rpm                                                                                                                    27 MB/s | 109 kB     00:00   
393(169/195): perl-Unicode-Normalize-1.26-417.fc29.x86_64.rpm                                                                                                    16 MB/s |  81 kB     00:00   
394(170/195): perl-autodie-2.29-418.fc29.noarch.rpm                                                                                                              19 MB/s |  95 kB     00:00   
395(171/195): perl-constant-1.33-418.fc29.noarch.rpm                                                                                                            7.4 MB/s |  23 kB     00:00   
396(172/195): perl-Unicode-Collate-1.25-417.fc29.x86_64.rpm                                                                                                      42 MB/s | 688 kB     00:00   
397(173/195): perl-experimental-0.020-3.fc29.noarch.rpm                                                                                                         4.1 MB/s |  21 kB     00:00   
398(174/195): perl-encoding-2.22-6.fc29.x86_64.rpm                                                                                                              6.9 MB/s |  63 kB     00:00   
399(175/195): perl-inc-latest-0.500-11.fc29.noarch.rpm                                                                                                          5.8 MB/s |  24 kB     00:00   
400(176/195): perl-libnet-3.11-418.fc29.noarch.rpm                                                                                                               19 MB/s | 120 kB     00:00   
401(177/195): perl-parent-0.237-2.fc29.noarch.rpm                                                                                                               4.5 MB/s |  14 kB     00:00   
402(178/195): perl-local-lib-2.000024-4.fc29.noarch.rpm                                                                                                         8.3 MB/s |  68 kB     00:00   
403(179/195): perl-podlators-4.11-3.fc29.noarch.rpm                                                                                                              19 MB/s | 115 kB     00:00   
404(180/195): perl-srpm-macros-1-28.fc29.noarch.rpm                                                                                                             3.9 MB/s | 8.1 kB     00:00   
405(181/195): perl-perlfaq-5.20180915-1.fc29.noarch.rpm                                                                                                          34 MB/s | 385 kB     00:00   
406(182/195): perl-threads-2.22-417.fc29.x86_64.rpm                                                                                                             8.0 MB/s |  57 kB     00:00   
407(183/195): perl-version-0.99.24-5.fc29.x86_64.rpm                                                                                                             10 MB/s |  63 kB     00:00   
408(184/195): pkgconf-1.5.3-2.fc29.x86_64.rpm                                                                                                                   5.4 MB/s |  39 kB     00:00   
409(185/195): pkgconf-pkg-config-1.5.3-2.fc29.x86_64.rpm                                                                                                        3.6 MB/s |  15 kB     00:00   
410(186/195): pkgconf-m4-1.5.3-2.fc29.noarch.rpm                                                                                                                3.2 MB/s |  17 kB     00:00   
411(187/195): python-srpm-macros-3-37.fc29.noarch.rpm                                                                                                           2.8 MB/s |  11 kB     00:00   
412(188/195): python3-pyparsing-2.2.0-3.fc29.noarch.rpm                                                                                                          19 MB/s | 138 kB     00:00   
413(189/195): qt5-srpm-macros-5.11.1-4.fc29.noarch.rpm                                                                                                          1.5 MB/s | 9.4 kB     00:00   
414(190/195): python2-setuptools-40.4.3-1.fc29.noarch.rpm                                                                                                        41 MB/s | 631 kB     00:00   
415(191/195): redhat-rpm-config-118-1.fc29.noarch.rpm                                                                                                           6.2 MB/s |  58 kB     00:00   
416(192/195): rhash-1.3.5-3.fc29.x86_64.rpm                                                                                                                      14 MB/s | 129 kB     00:00   
417(193/195): rust-srpm-macros-6-1.fc29.noarch.rpm                                                                                                              2.0 MB/s | 8.4 kB     00:00   
418(194/195): zip-3.0-23.fc29.x86_64.rpm                                                                                                                         43 MB/s | 264 kB     00:00   
419(195/195): zlib-devel-1.2.11-14.fc29.x86_64.rpm                                                                                                               11 MB/s |  46 kB     00:00   
420---------------------------------------------------------------------------------------------------------------------------------------------------------------------------------------------
421Total                                                                                                                                                         19 MB/s |  98 MB     00:05     
422Running transaction check
423Transaction check succeeded.
424Running transaction test
425Transaction test succeeded.
426Running transaction
427  Preparing        :                                                                                                                                                                     1/1
428  Installing       : perl-Carp-1.50-417.fc29.noarch                                                                                                                                    1/195
429  Installing       : perl-Exporter-5.73-418.fc29.noarch                                                                                                                                2/195
430  Installing       : perl-libs-4:5.28.1-427.fc29.x86_64                                                                                                                                3/195
431  Installing       : perl-Scalar-List-Utils-3:1.50-417.fc29.x86_64                                                                                                                     4/195
432  Installing       : perl-parent-1:0.237-2.fc29.noarch                                                                                                                                 5/195
433  Installing       : perl-Text-ParseWords-3.30-417.fc29.noarch                                                                                                                         6/195
434  Installing       : perl-Time-HiRes-1.9759-417.fc29.x86_64                                                                                                                            7/195
435  Installing       : perl-Term-ANSIColor-4.06-418.fc29.noarch                                                                                                                          8/195
436  Installing       : perl-Perl-OSType-1.010-418.fc29.noarch                                                                                                                            9/195
437  Installing       : perl-Unicode-Normalize-1.26-417.fc29.x86_64                                                                                                                      10/195
438  Installing       : libmpc-1.1.0-2.fc29.x86_64                                                                                                                                       11/195
439  Installing       : perl-macros-4:5.28.1-427.fc29.x86_64                                                                                                                             12/195
440  Installing       : perl-IO-1.39-427.fc29.x86_64                                                                                                                                     13/195
441  Installing       : perl-Socket-4:2.027-417.fc29.x86_64                                                                                                                              14/195
442  Installing       : perl-Text-Tabs+Wrap-2013.0523-417.fc29.noarch                                                                                                                    15/195
443  Installing       : perl-constant-1.33-418.fc29.noarch                                                                                                                               16/195
444  Installing       : perl-threads-shared-1.59-1.fc29.x86_64                                                                                                                           17/195
445  Installing       : perl-threads-1:2.22-417.fc29.x86_64                                                                                                                              18/195
446  Installing       : perl-interpreter-4:5.28.1-427.fc29.x86_64                                                                                                                        19/195
447  Installing       : perl-Errno-1.29-427.fc29.x86_64                                                                                                                                  20/195
448  Installing       : perl-PathTools-3.75-1.fc29.x86_64                                                                                                                                21/195
449  Installing       : perl-File-Path-2.16-1.fc29.noarch                                                                                                                                22/195
450  Installing       : perl-Data-Dumper-2.173-1.fc29.x86_64                                                                                                                             23/195
451  Installing       : perl-version-7:0.99.24-5.fc29.x86_64                                                                                                                             24/195
452  Installing       : perl-File-Temp-1:0.230.800-2.fc29.noarch                                                                                                                         25/195
453  Installing       : perl-MIME-Base64-3.15-417.fc29.x86_64                                                                                                                            26/195
454  Installing       : perl-Time-Local-2:1.280-3.fc29.noarch                                                                                                                            27/195
455  Installing       : perl-CPAN-Meta-Requirements-2.140-418.fc29.noarch                                                                                                                28/195
456  Installing       : perl-ExtUtils-Manifest-1:1.71-3.fc29.noarch                                                                                                                      29/195
457  Installing       : perl-IO-Socket-IP-0.39-418.fc29.noarch                                                                                                                           30/195
458  Installing       : perl-Storable-1:3.11-5.fc29.x86_64                                                                                                                               31/195
459  Installing       : perl-Digest-1.17-417.fc29.noarch                                                                                                                                 32/195
460  Installing       : perl-Digest-MD5-2.55-417.fc29.x86_64                                                                                                                             33/195
461  Installing       : perl-Module-CoreList-1:5.20181130-1.fc29.noarch                                                                                                                  34/195
462  Installing       : perl-Module-Metadata-1.000033-417.fc29.noarch                                                                                                                    35/195
463  Installing       : perl-Module-Load-1:0.32-417.fc29.noarch                                                                                                                          36/195
464  Installing       : perl-Compress-Raw-Zlib-2.081-4.fc29.x86_64                                                                                                                       37/195
465  Installing       : perl-SelfLoader-1.25-427.fc29.noarch                                                                                                                             38/195
466  Installing       : perl-Text-Balanced-2.03-417.fc29.noarch                                                                                                                          39/195
467  Installing       : perl-ExtUtils-Command-1:7.34-418.fc29.noarch                                                                                                                     40/195
468  Installing       : perl-Math-Complex-1.59-427.fc29.noarch                                                                                                                           41/195
469  Installing       : perl-Math-BigInt-1:1.9998.13-3.fc29.noarch                                                                                                                       42/195
470  Installing       : perl-Math-BigRat-0.2614-3.fc29.noarch                                                                                                                            43/195
471  Installing       : perl-Net-Ping-2.62-427.fc29.noarch                                                                                                                               44/195
472  Installing       : perl-CPAN-Meta-YAML-0.018-418.fc29.noarch                                                                                                                        45/195
473  Installing       : perl-Compress-Raw-Bzip2-2.081-5.fc29.x86_64                                                                                                                      46/195
474  Installing       : perl-Devel-PPPort-3.42-3.fc29.x86_64                                                                                                                             47/195
475  Installing       : perl-Locale-Maketext-1.29-418.fc29.noarch                                                                                                                        48/195
476  Installing       : perl-Locale-Maketext-Simple-1:0.21-427.fc29.noarch                                                                                                               49/195
477  Installing       : perl-Params-Check-1:0.38-417.fc29.noarch                                                                                                                         50/195
478  Installing       : perl-Module-Load-Conditional-0.68-417.fc29.noarch                                                                                                                51/195
479  Installing       : perl-Params-Util-1.07-25.fc29.x86_64                                                                                                                             52/195
480  Installing       : perl-Pod-Escapes-1:1.07-417.fc29.noarch                                                                                                                          53/195
481  Installing       : perl-Sub-Install-0.928-17.fc29.noarch                                                                                                                            54/195
482  Installing       : perl-Term-Cap-1.17-417.fc29.noarch                                                                                                                               55/195
483  Installing       : emacs-filesystem-1:26.1-6.fc29.noarch                                                                                                                            56/195
484  Installing       : cmake-rpm-macros-3.12.1-1.fc29.noarch                                                                                                                            57/195
485  Installing       : cmake-filesystem-3.12.1-1.fc29.x86_64                                                                                                                            58/195
486  Installing       : perl-Data-OptList-0.110-8.fc29.noarch                                                                                                                            59/195
487  Installing       : perl-bignum-0.51-1.fc29.noarch                                                                                                                                   60/195
488  Installing       : perl-Math-BigInt-FastCalc-0.500.700-3.fc29.x86_64                                                                                                                61/195
489  Installing       : perl-Devel-SelfStubber-1.06-427.fc29.noarch                                                                                                                      62/195
490  Installing       : perl-Config-Perl-V-0.30-2.fc29.noarch                                                                                                                            63/195
491  Installing       : perl-Memoize-1.03-427.fc29.noarch                                                                                                                                64/195
492  Installing       : perl-Test-Simple-2:1.302140-1.fc29.noarch                                                                                                                        65/195
493  Installing       : perl-Time-Piece-1.33-427.fc29.x86_64                                                                                                                             66/195
494  Installing       : perl-Net-SSLeay-1.85-8.fc29.x86_64                                                                                                                               67/195
495  Installing       : perl-PerlIO-via-QuotedPrint-0.08-417.fc29.noarch                                                                                                                 68/195
496  Installing       : perl-Test-1.31-427.fc29.noarch                                                                                                                                   69/195
497  Installing       : perl-experimental-0.020-3.fc29.noarch                                                                                                                            70/195
498  Installing       : perl-utils-5.28.1-427.fc29.noarch                                                                                                                                71/195
499  Installing       : perl-DB_File-1.843-1.fc29.x86_64                                                                                                                                 72/195
500  Installing       : perl-File-Which-1.22-4.fc29.noarch                                                                                                                               73/195
501  Installing       : perl-File-HomeDir-1.004-3.fc29.noarch                                                                                                                            74/195
502  Installing       : perl-Mozilla-CA-20180117-3.fc29.noarch                                                                                                                           75/195
503  Installing       : perl-Encode-4:2.98-6.fc29.x86_64                                                                                                                                 76/195
504  Installing       : perl-Pod-Simple-1:3.35-417.fc29.noarch                                                                                                                           77/195
505  Installing       : perl-Getopt-Long-1:2.50-417.fc29.noarch                                                                                                                          78/195
506  Installing       : perl-podlators-1:4.11-3.fc29.noarch                                                                                                                              79/195
507  Installing       : perl-Pod-Usage-4:1.69-417.fc29.noarch                                                                                                                            80/195
508  Installing       : perl-Pod-Perldoc-3.28.01-418.fc29.noarch                                                                                                                         81/195
509  Installing       : perl-HTTP-Tiny-0.076-1.fc29.noarch                                                                                                                               82/195
510  Installing       : perl-libnet-3.11-418.fc29.noarch                                                                                                                                 83/195
511  Installing       : perl-URI-1.74-4.fc29.noarch                                                                                                                                      84/195
512  Installing       : perl-IO-Socket-SSL-2.060-2.fc29.noarch                                                                                                                           85/195
513  Installing       : perl-ExtUtils-ParseXS-1:3.39-418.fc29.noarch                                                                                                                     86/195
514  Installing       : perl-IO-Compress-2.081-5.fc29.noarch                                                                                                                             87/195
515  Installing       : perl-JSON-PP-1:2.97.001-418.fc29.noarch                                                                                                                          88/195
516  Installing       : perl-CPAN-Meta-2.150010-417.fc29.noarch                                                                                                                          89/195
517  Installing       : perl-Test-Harness-1:3.42-418.fc29.noarch                                                                                                                         90/195
518  Installing       : perl-IO-Zlib-1:1.10-427.fc29.noarch                                                                                                                              91/195
519  Installing       : perl-Pod-Html-1.24-427.fc29.noarch                                                                                                                               92/195
520  Installing       : perl-Digest-SHA-1:6.02-4.fc29.x86_64                                                                                                                             93/195
521  Installing       : perl-Module-CoreList-tools-1:5.20181130-1.fc29.noarch                                                                                                            94/195
522  Installing       : perl-Pod-Checker-4:1.73-417.fc29.noarch                                                                                                                          95/195
523  Installing       : perl-Pod-Parser-1.63-418.fc29.noarch                                                                                                                             96/195
524  Installing       : perl-Archive-Zip-1.64-1.fc29.noarch                                                                                                                              97/195
525  Installing       : perl-Encode-Locale-1.05-11.fc29.noarch                                                                                                                           98/195
526  Installing       : perl-Unicode-Collate-1.25-417.fc29.x86_64                                                                                                                        99/195
527  Installing       : perl-local-lib-2.000024-4.fc29.noarch                                                                                                                           100/195
528  Installing       : perl-Locale-Codes-3.59-1.fc29.noarch                                                                                                                            101/195
529  Installing       : perl-Module-Loaded-1:0.08-427.fc29.noarch                                                                                                                       102/195
530  Installing       : perl-Algorithm-Diff-1.1903-11.fc29.noarch                                                                                                                       103/195
531  Installing       : perl-Text-Diff-1.45-4.fc29.noarch                                                                                                                               104/195
532  Installing       : perl-Archive-Tar-2.30-418.fc29.noarch                                                                                                                           105/195
533  Installing       : perl-B-Debug-1.26-418.fc29.noarch                                                                                                                               106/195
534  Installing       : perl-Compress-Bzip2-2.26-9.fc29.x86_64                                                                                                                          107/195
535  Installing       : perl-Devel-Size-0.82-3.fc29.x86_64                                                                                                                              108/195
536  Installing       : perl-Env-1.04-417.fc29.noarch                                                                                                                                   109/195
537  Installing       : perl-ExtUtils-MM-Utils-1:7.34-418.fc29.noarch                                                                                                                   110/195
538  Installing       : perl-IPC-Cmd-2:1.02-4.fc29.noarch                                                                                                                               111/195
539  Installing       : perl-File-Fetch-0.56-417.fc29.noarch                                                                                                                            112/195
540  Installing       : perl-IPC-SysV-2.07-418.fc29.x86_64                                                                                                                              113/195
541  Installing       : perl-IPC-System-Simple-1.25-20.fc29.noarch                                                                                                                      114/195
542  Installing       : perl-autodie-2.29-418.fc29.noarch                                                                                                                               115/195
543  Installing       : perl-Package-Generator-1.106-13.fc29.noarch                                                                                                                     116/195
544  Installing       : perl-Sub-Exporter-0.987-17.fc29.noarch                                                                                                                          117/195
545  Installing       : perl-Sys-Syslog-0.35-418.fc29.x86_64                                                                                                                            118/195
546  Installing       : perl-TermReadKey-2.37-9.fc29.x86_64                                                                                                                             119/195
547  Installing       : perl-Text-Glob-0.11-6.fc29.noarch                                                                                                                               120/195
548  Installing       : perl-Text-Template-1.53-3.fc29.noarch                                                                                                                           121/195
549  Installing       : perl-Thread-Queue-3.13-1.fc29.noarch                                                                                                                            122/195
550  Installing       : cpp-8.2.1-6.fc29.x86_64                                                                                                                                         123/195
551  Running scriptlet: cpp-8.2.1-6.fc29.x86_64                                                                                                                                         123/195
552  Installing       : perl-Attribute-Handlers-1.01-427.fc29.noarch                                                                                                                    124/195
553  Installing       : perl-Devel-Peek-1.27-427.fc29.x86_64                                                                                                                            125/195
554  Installing       : perl-MRO-Compat-0.13-6.fc29.noarch                                                                                                                              126/195
555  Installing       : perl-Data-Section-0.200007-5.fc29.noarch                                                                                                                        127/195
556  Installing       : perl-Software-License-0.103013-5.fc29.noarch                                                                                                                    128/195
557  Installing       : perl-perlfaq-5.20180915-1.fc29.noarch                                                                                                                           129/195
558  Installing       : rust-srpm-macros-6-1.fc29.noarch                                                                                                                                130/195
559  Installing       : rhash-1.3.5-3.fc29.x86_64                                                                                                                                       131/195
560  Running scriptlet: rhash-1.3.5-3.fc29.x86_64                                                                                                                                       131/195
561  Installing       : qt5-srpm-macros-5.11.1-4.fc29.noarch                                                                                                                            132/195
562  Installing       : python3-pyparsing-2.2.0-3.fc29.noarch                                                                                                                           133/195
563  Installing       : systemtap-sdt-devel-4.0-2.fc29.x86_64                                                                                                                           134/195
564  Installing       : python-srpm-macros-3-37.fc29.noarch                                                                                                                             135/195
565  Installing       : pkgconf-m4-1.5.3-2.fc29.noarch                                                                                                                                  136/195
566  Installing       : perl-srpm-macros-1-28.fc29.noarch                                                                                                                               137/195
567  Installing       : openblas-srpm-macros-2-4.fc29.noarch                                                                                                                            138/195
568  Installing       : ocaml-srpm-macros-5-4.fc29.noarch                                                                                                                               139/195
569  Installing       : nim-srpm-macros-1-3.fc29.noarch                                                                                                                                 140/195
570  Installing       : ncurses-c++-libs-6.1-8.20180923.fc29.x86_64                                                                                                                     141/195
571  Installing       : libpkgconf-1.5.3-2.fc29.x86_64                                                                                                                                  142/195
572  Installing       : pkgconf-1.5.3-2.fc29.x86_64                                                                                                                                     143/195
573  Installing       : pkgconf-pkg-config-1.5.3-2.fc29.x86_64                                                                                                                          144/195
574  Installing       : ncurses-devel-6.1-8.20180923.fc29.x86_64                                                                                                                        145/195
575  Installing       : jsoncpp-1.8.4-5.fc29.x86_64                                                                                                                                     146/195
576  Installing       : isl-0.16.1-7.fc29.x86_64                                                                                                                                        147/195
577  Running scriptlet: isl-0.16.1-7.fc29.x86_64                                                                                                                                        147/195
578  Installing       : go-srpm-macros-2-18.fc29.noarch                                                                                                                                 148/195
579  Installing       : gnat-srpm-macros-4-6.fc29.noarch                                                                                                                                149/195
580  Installing       : ghc-srpm-macros-1.4.2-8.fc29.noarch                                                                                                                             150/195
581  Installing       : gdbm-1:1.18-1.fc29.x86_64                                                                                                                                       151/195
582  Installing       : fpc-srpm-macros-1.1-5.fc29.noarch                                                                                                                               152/195
583  Installing       : efi-srpm-macros-3-3.fc29.noarch                                                                                                                                 153/195
584  Installing       : dwz-0.12-9.fc29.x86_64                                                                                                                                          154/195
585  Installing       : compat-openssl10-1:1.0.2o-3.fc29.x86_64                                                                                                                         155/195
586  Running scriptlet: compat-openssl10-1:1.0.2o-3.fc29.x86_64                                                                                                                         155/195
587  Installing       : python2-libs-2.7.15-11.fc29.x86_64                                                                                                                              156/195
588  Installing       : python2-pip-18.1-1.fc29.noarch                                                                                                                                  157/195
589  Installing       : python2-setuptools-40.4.3-1.fc29.noarch                                                                                                                         158/195
590  Installing       : python2-2.7.15-11.fc29.x86_64                                                                                                                                   159/195
591  Installing       : python-unversioned-command-2.7.15-11.fc29.noarch                                                                                                                160/195
592  Installing       : annobin-8.23-1.fc29.x86_64                                                                                                                                      161/195
593  Installing       : vim-filesystem-2:8.1.575-1.fc29.noarch                                                                                                                          162/195
594  Installing       : unzip-6.0-42.fc29.x86_64                                                                                                                                        163/195
595  Installing       : zip-3.0-23.fc29.x86_64                                                                                                                                          164/195
596  Installing       : redhat-rpm-config-118-1.fc29.noarch                                                                                                                             165/195
597  Installing       : libuv-1:1.23.2-1.fc29.x86_64                                                                                                                                    166/195
598  Installing       : cmake-data-3.12.1-1.fc29.noarch                                                                                                                                 167/195
599  Installing       : cmake-3.12.1-1.fc29.x86_64                                                                                                                                      168/195
600  Installing       : libstdc++-devel-8.2.1-6.fc29.x86_64                                                                                                                             169/195
601  Installing       : kernel-headers-4.19.9-300.fc29.x86_64                                                                                                                           170/195
602  Running scriptlet: glibc-headers-2.28-26.fc29.x86_64                                                                                                                               171/195
603  Installing       : glibc-headers-2.28-26.fc29.x86_64                                                                                                                               171/195
604  Installing       : libxcrypt-devel-4.4.1-1.fc29.x86_64                                                                                                                             172/195
605  Installing       : glibc-devel-2.28-26.fc29.x86_64                                                                                                                                 173/195
606  Running scriptlet: glibc-devel-2.28-26.fc29.x86_64                                                                                                                                 173/195
607  Installing       : binutils-2.31.1-15.fc29.x86_64                                                                                                                                  174/195
608  Running scriptlet: binutils-2.31.1-15.fc29.x86_64                                                                                                                                  174/195
609  Installing       : gcc-8.2.1-6.fc29.x86_64                                                                                                                                         175/195
610  Running scriptlet: gcc-8.2.1-6.fc29.x86_64                                                                                                                                         175/195
611  Installing       : perl-devel-4:5.28.1-427.fc29.x86_64                                                                                                                             176/195
612  Installing       : perl-ExtUtils-Install-2.14-418.fc29.noarch                                                                                                                      177/195
613  Installing       : perl-ExtUtils-MakeMaker-1:7.34-418.fc29.noarch                                                                                                                  178/195
614  Installing       : perl-Filter-2:1.59-1.fc29.x86_64                                                                                                                                179/195
615  Installing       : perl-encoding-4:2.22-6.fc29.x86_64                                                                                                                              180/195
616  Installing       : perl-ExtUtils-Embed-1.35-427.fc29.noarch                                                                                                                        181/195
617  Installing       : perl-ExtUtils-Miniperl-1.08-427.fc29.noarch                                                                                                                     182/195
618  Installing       : perl-open-1.11-427.fc29.noarch                                                                                                                                  183/195
619  Installing       : perl-Filter-Simple-0.95-417.fc29.noarch                                                                                                                         184/195
620  Installing       : perl-libnetcfg-4:5.28.1-427.fc29.noarch                                                                                                                         185/195
621  Installing       : perl-inc-latest-2:0.500-11.fc29.noarch                                                                                                                          186/195
622  Installing       : perl-Encode-devel-4:2.98-6.fc29.x86_64                                                                                                                          187/195
623  Installing       : gcc-c++-8.2.1-6.fc29.x86_64                                                                                                                                     188/195
624  Installing       : perl-ExtUtils-CBuilder-1:0.280230-417.fc29.noarch                                                                                                               189/195
625  Installing       : perl-Module-Build-2:0.42.24-10.fc29.noarch                                                                                                                      190/195
626  Installing       : perl-CPAN-2.20-418.fc29.noarch                                                                                                                                  191/195
627  Installing       : perl-4:5.28.1-427.fc29.x86_64                                                                                                                                   192/195
628  Installing       : ninja-build-1.8.2-5.fc29.x86_64                                                                                                                                 193/195
629  Installing       : libedit-devel-3.1-24.20170329cvs.fc29.x86_64                                                                                                                    194/195
630  Installing       : zlib-devel-1.2.11-14.fc29.x86_64                                                                                                                                195/195
631  Running scriptlet: zlib-devel-1.2.11-14.fc29.x86_64                                                                                                                                195/195
632  Verifying        : binutils-2.31.1-15.fc29.x86_64                                                                                                                                    1/195
633  Verifying        : cpp-8.2.1-6.fc29.x86_64                                                                                                                                           2/195
634  Verifying        : gcc-8.2.1-6.fc29.x86_64                                                                                                                                           3/195
635  Verifying        : gcc-c++-8.2.1-6.fc29.x86_64                                                                                                                                       4/195
636  Verifying        : glibc-devel-2.28-26.fc29.x86_64                                                                                                                                   5/195
637  Verifying        : glibc-headers-2.28-26.fc29.x86_64                                                                                                                                 6/195
638  Verifying        : kernel-headers-4.19.9-300.fc29.x86_64                                                                                                                             7/195
639  Verifying        : libstdc++-devel-8.2.1-6.fc29.x86_64                                                                                                                               8/195
640  Verifying        : libuv-1:1.23.2-1.fc29.x86_64                                                                                                                                      9/195
641  Verifying        : libxcrypt-devel-4.4.1-1.fc29.x86_64                                                                                                                              10/195
642  Verifying        : perl-4:5.28.1-427.fc29.x86_64                                                                                                                                    11/195
643  Verifying        : perl-Attribute-Handlers-1.01-427.fc29.noarch                                                                                                                     12/195
644  Verifying        : perl-DB_File-1.843-1.fc29.x86_64                                                                                                                                 13/195
645  Verifying        : perl-Data-Dumper-2.173-1.fc29.x86_64                                                                                                                             14/195
646  Verifying        : perl-Devel-Peek-1.27-427.fc29.x86_64                                                                                                                             15/195
647  Verifying        : perl-Devel-SelfStubber-1.06-427.fc29.noarch                                                                                                                      16/195
648  Verifying        : perl-Errno-1.29-427.fc29.x86_64                                                                                                                                  17/195
649  Verifying        : perl-ExtUtils-Embed-1.35-427.fc29.noarch                                                                                                                         18/195
650  Verifying        : perl-ExtUtils-Miniperl-1.08-427.fc29.noarch                                                                                                                      19/195
651  Verifying        : perl-ExtUtils-ParseXS-1:3.39-418.fc29.noarch                                                                                                                     20/195
652  Verifying        : perl-IO-1.39-427.fc29.x86_64                                                                                                                                     21/195
653  Verifying        : perl-IO-Zlib-1:1.10-427.fc29.noarch                                                                                                                              22/195
654  Verifying        : perl-Locale-Codes-3.59-1.fc29.noarch                                                                                                                             23/195
655  Verifying        : perl-Locale-Maketext-Simple-1:0.21-427.fc29.noarch                                                                                                               24/195
656  Verifying        : perl-Math-Complex-1.59-427.fc29.noarch                                                                                                                           25/195
657  Verifying        : perl-Memoize-1.03-427.fc29.noarch                                                                                                                                26/195
658  Verifying        : perl-Module-CoreList-1:5.20181130-1.fc29.noarch                                                                                                                  27/195
659  Verifying        : perl-Module-CoreList-tools-1:5.20181130-1.fc29.noarch                                                                                                            28/195
660  Verifying        : perl-Module-Loaded-1:0.08-427.fc29.noarch                                                                                                                        29/195
661  Verifying        : perl-Net-Ping-2.62-427.fc29.noarch                                                                                                                               30/195
662  Verifying        : perl-Pod-Html-1.24-427.fc29.noarch                                                                                                                               31/195
663  Verifying        : perl-SelfLoader-1.25-427.fc29.noarch                                                                                                                             32/195
664  Verifying        : perl-Test-1.31-427.fc29.noarch                                                                                                                                   33/195
665  Verifying        : perl-Time-Piece-1.33-427.fc29.x86_64                                                                                                                             34/195
666  Verifying        : perl-bignum-0.51-1.fc29.noarch                                                                                                                                   35/195
667  Verifying        : perl-devel-4:5.28.1-427.fc29.x86_64                                                                                                                              36/195
668  Verifying        : perl-interpreter-4:5.28.1-427.fc29.x86_64                                                                                                                        37/195
669  Verifying        : perl-libnetcfg-4:5.28.1-427.fc29.noarch                                                                                                                          38/195
670  Verifying        : perl-libs-4:5.28.1-427.fc29.x86_64                                                                                                                               39/195
671  Verifying        : perl-macros-4:5.28.1-427.fc29.x86_64                                                                                                                             40/195
672  Verifying        : perl-open-1.11-427.fc29.noarch                                                                                                                                   41/195
673  Verifying        : perl-threads-shared-1.59-1.fc29.x86_64                                                                                                                           42/195
674  Verifying        : perl-utils-5.28.1-427.fc29.noarch                                                                                                                                43/195
675  Verifying        : python-unversioned-command-2.7.15-11.fc29.noarch                                                                                                                 44/195
676  Verifying        : python2-2.7.15-11.fc29.x86_64                                                                                                                                    45/195
677  Verifying        : python2-libs-2.7.15-11.fc29.x86_64                                                                                                                               46/195
678  Verifying        : python2-pip-18.1-1.fc29.noarch                                                                                                                                   47/195
679  Verifying        : systemtap-sdt-devel-4.0-2.fc29.x86_64                                                                                                                            48/195
680  Verifying        : unzip-6.0-42.fc29.x86_64                                                                                                                                         49/195
681  Verifying        : vim-filesystem-2:8.1.575-1.fc29.noarch                                                                                                                           50/195
682  Verifying        : annobin-8.23-1.fc29.x86_64                                                                                                                                       51/195
683  Verifying        : cmake-3.12.1-1.fc29.x86_64                                                                                                                                       52/195
684  Verifying        : cmake-data-3.12.1-1.fc29.noarch                                                                                                                                  53/195
685  Verifying        : cmake-filesystem-3.12.1-1.fc29.x86_64                                                                                                                            54/195
686  Verifying        : cmake-rpm-macros-3.12.1-1.fc29.noarch                                                                                                                            55/195
687  Verifying        : compat-openssl10-1:1.0.2o-3.fc29.x86_64                                                                                                                          56/195
688  Verifying        : dwz-0.12-9.fc29.x86_64                                                                                                                                           57/195
689  Verifying        : efi-srpm-macros-3-3.fc29.noarch                                                                                                                                  58/195
690  Verifying        : emacs-filesystem-1:26.1-6.fc29.noarch                                                                                                                            59/195
691  Verifying        : fpc-srpm-macros-1.1-5.fc29.noarch                                                                                                                                60/195
692  Verifying        : gdbm-1:1.18-1.fc29.x86_64                                                                                                                                        61/195
693  Verifying        : ghc-srpm-macros-1.4.2-8.fc29.noarch                                                                                                                              62/195
694  Verifying        : gnat-srpm-macros-4-6.fc29.noarch                                                                                                                                 63/195
695  Verifying        : go-srpm-macros-2-18.fc29.noarch                                                                                                                                  64/195
696  Verifying        : isl-0.16.1-7.fc29.x86_64                                                                                                                                         65/195
697  Verifying        : jsoncpp-1.8.4-5.fc29.x86_64                                                                                                                                      66/195
698  Verifying        : libedit-devel-3.1-24.20170329cvs.fc29.x86_64                                                                                                                     67/195
699  Verifying        : libmpc-1.1.0-2.fc29.x86_64                                                                                                                                       68/195
700  Verifying        : libpkgconf-1.5.3-2.fc29.x86_64                                                                                                                                   69/195
701  Verifying        : ncurses-c++-libs-6.1-8.20180923.fc29.x86_64                                                                                                                      70/195
702  Verifying        : ncurses-devel-6.1-8.20180923.fc29.x86_64                                                                                                                         71/195
703  Verifying        : nim-srpm-macros-1-3.fc29.noarch                                                                                                                                  72/195
704  Verifying        : ninja-build-1.8.2-5.fc29.x86_64                                                                                                                                  73/195
705  Verifying        : ocaml-srpm-macros-5-4.fc29.noarch                                                                                                                                74/195
706  Verifying        : openblas-srpm-macros-2-4.fc29.noarch                                                                                                                             75/195
707  Verifying        : perl-Algorithm-Diff-1.1903-11.fc29.noarch                                                                                                                        76/195
708  Verifying        : perl-Archive-Tar-2.30-418.fc29.noarch                                                                                                                            77/195
709  Verifying        : perl-Archive-Zip-1.64-1.fc29.noarch                                                                                                                              78/195
710  Verifying        : perl-B-Debug-1.26-418.fc29.noarch                                                                                                                                79/195
711  Verifying        : perl-CPAN-2.20-418.fc29.noarch                                                                                                                                   80/195
712  Verifying        : perl-CPAN-Meta-2.150010-417.fc29.noarch                                                                                                                          81/195
713  Verifying        : perl-CPAN-Meta-Requirements-2.140-418.fc29.noarch                                                                                                                82/195
714  Verifying        : perl-CPAN-Meta-YAML-0.018-418.fc29.noarch                                                                                                                        83/195
715  Verifying        : perl-Carp-1.50-417.fc29.noarch                                                                                                                                   84/195
716  Verifying        : perl-Compress-Bzip2-2.26-9.fc29.x86_64                                                                                                                           85/195
717  Verifying        : perl-Compress-Raw-Bzip2-2.081-5.fc29.x86_64                                                                                                                      86/195
718  Verifying        : perl-Compress-Raw-Zlib-2.081-4.fc29.x86_64                                                                                                                       87/195
719  Verifying        : perl-Config-Perl-V-0.30-2.fc29.noarch                                                                                                                            88/195
720  Verifying        : perl-Data-OptList-0.110-8.fc29.noarch                                                                                                                            89/195
721  Verifying        : perl-Data-Section-0.200007-5.fc29.noarch                                                                                                                         90/195
722  Verifying        : perl-Devel-PPPort-3.42-3.fc29.x86_64                                                                                                                             91/195
723  Verifying        : perl-Devel-Size-0.82-3.fc29.x86_64                                                                                                                               92/195
724  Verifying        : perl-Digest-1.17-417.fc29.noarch                                                                                                                                 93/195
725  Verifying        : perl-Digest-MD5-2.55-417.fc29.x86_64                                                                                                                             94/195
726  Verifying        : perl-Digest-SHA-1:6.02-4.fc29.x86_64                                                                                                                             95/195
727  Verifying        : perl-Encode-4:2.98-6.fc29.x86_64                                                                                                                                 96/195
728  Verifying        : perl-Encode-Locale-1.05-11.fc29.noarch                                                                                                                           97/195
729  Verifying        : perl-Encode-devel-4:2.98-6.fc29.x86_64                                                                                                                           98/195
730  Verifying        : perl-Env-1.04-417.fc29.noarch                                                                                                                                    99/195
731  Verifying        : perl-Exporter-5.73-418.fc29.noarch                                                                                                                              100/195
732  Verifying        : perl-ExtUtils-CBuilder-1:0.280230-417.fc29.noarch                                                                                                               101/195
733  Verifying        : perl-ExtUtils-Command-1:7.34-418.fc29.noarch                                                                                                                    102/195
734  Verifying        : perl-ExtUtils-Install-2.14-418.fc29.noarch                                                                                                                      103/195
735  Verifying        : perl-ExtUtils-MM-Utils-1:7.34-418.fc29.noarch                                                                                                                   104/195
736  Verifying        : perl-ExtUtils-MakeMaker-1:7.34-418.fc29.noarch                                                                                                                  105/195
737  Verifying        : perl-ExtUtils-Manifest-1:1.71-3.fc29.noarch                                                                                                                     106/195
738  Verifying        : perl-File-Fetch-0.56-417.fc29.noarch                                                                                                                            107/195
739  Verifying        : perl-File-HomeDir-1.004-3.fc29.noarch                                                                                                                           108/195
740  Verifying        : perl-File-Path-2.16-1.fc29.noarch                                                                                                                               109/195
741  Verifying        : perl-File-Temp-1:0.230.800-2.fc29.noarch                                                                                                                        110/195
742  Verifying        : perl-File-Which-1.22-4.fc29.noarch                                                                                                                              111/195
743  Verifying        : perl-Filter-2:1.59-1.fc29.x86_64                                                                                                                                112/195
744  Verifying        : perl-Filter-Simple-0.95-417.fc29.noarch                                                                                                                         113/195
745  Verifying        : perl-Getopt-Long-1:2.50-417.fc29.noarch                                                                                                                         114/195
746  Verifying        : perl-HTTP-Tiny-0.076-1.fc29.noarch                                                                                                                              115/195
747  Verifying        : perl-IO-Compress-2.081-5.fc29.noarch                                                                                                                            116/195
748  Verifying        : perl-IO-Socket-IP-0.39-418.fc29.noarch                                                                                                                          117/195
749  Verifying        : perl-IO-Socket-SSL-2.060-2.fc29.noarch                                                                                                                          118/195
750  Verifying        : perl-IPC-Cmd-2:1.02-4.fc29.noarch                                                                                                                               119/195
751  Verifying        : perl-IPC-SysV-2.07-418.fc29.x86_64                                                                                                                              120/195
752  Verifying        : perl-IPC-System-Simple-1.25-20.fc29.noarch                                                                                                                      121/195
753  Verifying        : perl-JSON-PP-1:2.97.001-418.fc29.noarch                                                                                                                         122/195
754  Verifying        : perl-Locale-Maketext-1.29-418.fc29.noarch                                                                                                                       123/195
755  Verifying        : perl-MIME-Base64-3.15-417.fc29.x86_64                                                                                                                           124/195
756  Verifying        : perl-MRO-Compat-0.13-6.fc29.noarch                                                                                                                              125/195
757  Verifying        : perl-Math-BigInt-1:1.9998.13-3.fc29.noarch                                                                                                                      126/195
758  Verifying        : perl-Math-BigInt-FastCalc-0.500.700-3.fc29.x86_64                                                                                                               127/195
759  Verifying        : perl-Math-BigRat-0.2614-3.fc29.noarch                                                                                                                           128/195
760  Verifying        : perl-Module-Build-2:0.42.24-10.fc29.noarch                                                                                                                      129/195
761  Verifying        : perl-Module-Load-1:0.32-417.fc29.noarch                                                                                                                         130/195
762  Verifying        : perl-Module-Load-Conditional-0.68-417.fc29.noarch                                                                                                               131/195
763  Verifying        : perl-Module-Metadata-1.000033-417.fc29.noarch                                                                                                                   132/195
764  Verifying        : perl-Mozilla-CA-20180117-3.fc29.noarch                                                                                                                          133/195
765  Verifying        : perl-Net-SSLeay-1.85-8.fc29.x86_64                                                                                                                              134/195
766  Verifying        : perl-Package-Generator-1.106-13.fc29.noarch                                                                                                                     135/195
767  Verifying        : perl-Params-Check-1:0.38-417.fc29.noarch                                                                                                                        136/195
768  Verifying        : perl-Params-Util-1.07-25.fc29.x86_64                                                                                                                            137/195
769  Verifying        : perl-PathTools-3.75-1.fc29.x86_64                                                                                                                               138/195
770  Verifying        : perl-Perl-OSType-1.010-418.fc29.noarch                                                                                                                          139/195
771  Verifying        : perl-PerlIO-via-QuotedPrint-0.08-417.fc29.noarch                                                                                                                140/195
772  Verifying        : perl-Pod-Checker-4:1.73-417.fc29.noarch                                                                                                                         141/195
773  Verifying        : perl-Pod-Escapes-1:1.07-417.fc29.noarch                                                                                                                         142/195
774  Verifying        : perl-Pod-Parser-1.63-418.fc29.noarch                                                                                                                            143/195
775  Verifying        : perl-Pod-Perldoc-3.28.01-418.fc29.noarch                                                                                                                        144/195
776  Verifying        : perl-Pod-Simple-1:3.35-417.fc29.noarch                                                                                                                          145/195
777  Verifying        : perl-Pod-Usage-4:1.69-417.fc29.noarch                                                                                                                           146/195
778  Verifying        : perl-Scalar-List-Utils-3:1.50-417.fc29.x86_64                                                                                                                   147/195
779  Verifying        : perl-Socket-4:2.027-417.fc29.x86_64                                                                                                                             148/195
780  Verifying        : perl-Software-License-0.103013-5.fc29.noarch                                                                                                                    149/195
781  Verifying        : perl-Storable-1:3.11-5.fc29.x86_64                                                                                                                              150/195
782  Verifying        : perl-Sub-Exporter-0.987-17.fc29.noarch                                                                                                                          151/195
783  Verifying        : perl-Sub-Install-0.928-17.fc29.noarch                                                                                                                           152/195
784  Verifying        : perl-Sys-Syslog-0.35-418.fc29.x86_64                                                                                                                            153/195
785  Verifying        : perl-Term-ANSIColor-4.06-418.fc29.noarch                                                                                                                        154/195
786  Verifying        : perl-Term-Cap-1.17-417.fc29.noarch                                                                                                                              155/195
787  Verifying        : perl-TermReadKey-2.37-9.fc29.x86_64                                                                                                                             156/195
788  Verifying        : perl-Test-Harness-1:3.42-418.fc29.noarch                                                                                                                        157/195
789  Verifying        : perl-Test-Simple-2:1.302140-1.fc29.noarch                                                                                                                       158/195
790  Verifying        : perl-Text-Balanced-2.03-417.fc29.noarch                                                                                                                         159/195
791  Verifying        : perl-Text-Diff-1.45-4.fc29.noarch                                                                                                                               160/195
792  Verifying        : perl-Text-Glob-0.11-6.fc29.noarch                                                                                                                               161/195
793  Verifying        : perl-Text-ParseWords-3.30-417.fc29.noarch                                                                                                                       162/195
794  Verifying        : perl-Text-Tabs+Wrap-2013.0523-417.fc29.noarch                                                                                                                   163/195
795  Verifying        : perl-Text-Template-1.53-3.fc29.noarch                                                                                                                           164/195
796  Verifying        : perl-Thread-Queue-3.13-1.fc29.noarch                                                                                                                            165/195
797  Verifying        : perl-Time-HiRes-1.9759-417.fc29.x86_64                                                                                                                          166/195
798  Verifying        : perl-Time-Local-2:1.280-3.fc29.noarch                                                                                                                           167/195
799  Verifying        : perl-URI-1.74-4.fc29.noarch                                                                                                                                     168/195
800  Verifying        : perl-Unicode-Collate-1.25-417.fc29.x86_64                                                                                                                       169/195
801  Verifying        : perl-Unicode-Normalize-1.26-417.fc29.x86_64                                                                                                                     170/195
802  Verifying        : perl-autodie-2.29-418.fc29.noarch                                                                                                                               171/195
803  Verifying        : perl-constant-1.33-418.fc29.noarch                                                                                                                              172/195
804  Verifying        : perl-encoding-4:2.22-6.fc29.x86_64                                                                                                                              173/195
805  Verifying        : perl-experimental-0.020-3.fc29.noarch                                                                                                                           174/195
806  Verifying        : perl-inc-latest-2:0.500-11.fc29.noarch                                                                                                                          175/195
807  Verifying        : perl-libnet-3.11-418.fc29.noarch                                                                                                                                176/195
808  Verifying        : perl-local-lib-2.000024-4.fc29.noarch                                                                                                                           177/195
809  Verifying        : perl-parent-1:0.237-2.fc29.noarch                                                                                                                               178/195
810  Verifying        : perl-perlfaq-5.20180915-1.fc29.noarch                                                                                                                           179/195
811  Verifying        : perl-podlators-1:4.11-3.fc29.noarch                                                                                                                             180/195
812  Verifying        : perl-srpm-macros-1-28.fc29.noarch                                                                                                                               181/195
813  Verifying        : perl-threads-1:2.22-417.fc29.x86_64                                                                                                                             182/195
814  Verifying        : perl-version-7:0.99.24-5.fc29.x86_64                                                                                                                            183/195
815  Verifying        : pkgconf-1.5.3-2.fc29.x86_64                                                                                                                                     184/195
816  Verifying        : pkgconf-m4-1.5.3-2.fc29.noarch                                                                                                                                  185/195
817  Verifying        : pkgconf-pkg-config-1.5.3-2.fc29.x86_64                                                                                                                          186/195
818  Verifying        : python-srpm-macros-3-37.fc29.noarch                                                                                                                             187/195
819  Verifying        : python2-setuptools-40.4.3-1.fc29.noarch                                                                                                                         188/195
820  Verifying        : python3-pyparsing-2.2.0-3.fc29.noarch                                                                                                                           189/195
821  Verifying        : qt5-srpm-macros-5.11.1-4.fc29.noarch                                                                                                                            190/195
822  Verifying        : redhat-rpm-config-118-1.fc29.noarch                                                                                                                             191/195
823  Verifying        : rhash-1.3.5-3.fc29.x86_64                                                                                                                                       192/195
824  Verifying        : rust-srpm-macros-6-1.fc29.noarch                                                                                                                                193/195
825  Verifying        : zip-3.0-23.fc29.x86_64                                                                                                                                          194/195
826  Verifying        : zlib-devel-1.2.11-14.fc29.x86_64                                                                                                                                195/195
827
828Installed:
829  gcc-c++-8.2.1-6.fc29.x86_64                                      perl-4:5.28.1-427.fc29.x86_64                                python2-2.7.15-11.fc29.x86_64                               
830  cmake-3.12.1-1.fc29.x86_64                                       libedit-devel-3.1-24.20170329cvs.fc29.x86_64                 ninja-build-1.8.2-5.fc29.x86_64                             
831  zlib-devel-1.2.11-14.fc29.x86_64                                 python-unversioned-command-2.7.15-11.fc29.noarch             python2-pip-18.1-1.fc29.noarch                               
832  perl-Encode-Locale-1.05-11.fc29.noarch                           perl-IO-Socket-SSL-2.060-2.fc29.noarch                       perl-Mozilla-CA-20180117-3.fc29.noarch                       
833  perl-TermReadKey-2.37-9.fc29.x86_64                              python2-setuptools-40.4.3-1.fc29.noarch                      binutils-2.31.1-15.fc29.x86_64                               
834  cpp-8.2.1-6.fc29.x86_64                                          gcc-8.2.1-6.fc29.x86_64                                      glibc-devel-2.28-26.fc29.x86_64                             
835  glibc-headers-2.28-26.fc29.x86_64                                kernel-headers-4.19.9-300.fc29.x86_64                        libstdc++-devel-8.2.1-6.fc29.x86_64                         
836  libuv-1:1.23.2-1.fc29.x86_64                                     libxcrypt-devel-4.4.1-1.fc29.x86_64                          perl-Attribute-Handlers-1.01-427.fc29.noarch                 
837  perl-DB_File-1.843-1.fc29.x86_64                                 perl-Data-Dumper-2.173-1.fc29.x86_64                         perl-Devel-Peek-1.27-427.fc29.x86_64                         
838  perl-Devel-SelfStubber-1.06-427.fc29.noarch                      perl-Errno-1.29-427.fc29.x86_64                              perl-ExtUtils-Embed-1.35-427.fc29.noarch                     
839  perl-ExtUtils-Miniperl-1.08-427.fc29.noarch                      perl-ExtUtils-ParseXS-1:3.39-418.fc29.noarch                 perl-IO-1.39-427.fc29.x86_64                                 
840  perl-IO-Zlib-1:1.10-427.fc29.noarch                              perl-Locale-Codes-3.59-1.fc29.noarch                         perl-Locale-Maketext-Simple-1:0.21-427.fc29.noarch           
841  perl-Math-Complex-1.59-427.fc29.noarch                           perl-Memoize-1.03-427.fc29.noarch                            perl-Module-CoreList-1:5.20181130-1.fc29.noarch             
842  perl-Module-CoreList-tools-1:5.20181130-1.fc29.noarch            perl-Module-Loaded-1:0.08-427.fc29.noarch                    perl-Net-Ping-2.62-427.fc29.noarch                           
843  perl-Pod-Html-1.24-427.fc29.noarch                               perl-SelfLoader-1.25-427.fc29.noarch                         perl-Test-1.31-427.fc29.noarch                               
844  perl-Time-Piece-1.33-427.fc29.x86_64                             perl-bignum-0.51-1.fc29.noarch                               perl-devel-4:5.28.1-427.fc29.x86_64                         
845  perl-interpreter-4:5.28.1-427.fc29.x86_64                        perl-libnetcfg-4:5.28.1-427.fc29.noarch                      perl-libs-4:5.28.1-427.fc29.x86_64                           
846  perl-macros-4:5.28.1-427.fc29.x86_64                             perl-open-1.11-427.fc29.noarch                               perl-threads-shared-1.59-1.fc29.x86_64                       
847  perl-utils-5.28.1-427.fc29.noarch                                python2-libs-2.7.15-11.fc29.x86_64                           systemtap-sdt-devel-4.0-2.fc29.x86_64                       
848  unzip-6.0-42.fc29.x86_64                                         vim-filesystem-2:8.1.575-1.fc29.noarch                       annobin-8.23-1.fc29.x86_64                                   
849  cmake-data-3.12.1-1.fc29.noarch                                  cmake-filesystem-3.12.1-1.fc29.x86_64                        cmake-rpm-macros-3.12.1-1.fc29.noarch                       
850  compat-openssl10-1:1.0.2o-3.fc29.x86_64                          dwz-0.12-9.fc29.x86_64                                       efi-srpm-macros-3-3.fc29.noarch                             
851  emacs-filesystem-1:26.1-6.fc29.noarch                            fpc-srpm-macros-1.1-5.fc29.noarch                            gdbm-1:1.18-1.fc29.x86_64                                   
852  ghc-srpm-macros-1.4.2-8.fc29.noarch                              gnat-srpm-macros-4-6.fc29.noarch                             go-srpm-macros-2-18.fc29.noarch                             
853  isl-0.16.1-7.fc29.x86_64                                         jsoncpp-1.8.4-5.fc29.x86_64                                  libmpc-1.1.0-2.fc29.x86_64                                   
854  libpkgconf-1.5.3-2.fc29.x86_64                                   ncurses-c++-libs-6.1-8.20180923.fc29.x86_64                  ncurses-devel-6.1-8.20180923.fc29.x86_64                     
855  nim-srpm-macros-1-3.fc29.noarch                                  ocaml-srpm-macros-5-4.fc29.noarch                            openblas-srpm-macros-2-4.fc29.noarch                         
856  perl-Algorithm-Diff-1.1903-11.fc29.noarch                        perl-Archive-Tar-2.30-418.fc29.noarch                        perl-Archive-Zip-1.64-1.fc29.noarch                         
857  perl-B-Debug-1.26-418.fc29.noarch                                perl-CPAN-2.20-418.fc29.noarch                               perl-CPAN-Meta-2.150010-417.fc29.noarch                     
858  perl-CPAN-Meta-Requirements-2.140-418.fc29.noarch                perl-CPAN-Meta-YAML-0.018-418.fc29.noarch                    perl-Carp-1.50-417.fc29.noarch                               
859  perl-Compress-Bzip2-2.26-9.fc29.x86_64                           perl-Compress-Raw-Bzip2-2.081-5.fc29.x86_64                  perl-Compress-Raw-Zlib-2.081-4.fc29.x86_64                   
860  perl-Config-Perl-V-0.30-2.fc29.noarch                            perl-Data-OptList-0.110-8.fc29.noarch                        perl-Data-Section-0.200007-5.fc29.noarch                     
861  perl-Devel-PPPort-3.42-3.fc29.x86_64                             perl-Devel-Size-0.82-3.fc29.x86_64                           perl-Digest-1.17-417.fc29.noarch                             
862  perl-Digest-MD5-2.55-417.fc29.x86_64                             perl-Digest-SHA-1:6.02-4.fc29.x86_64                         perl-Encode-4:2.98-6.fc29.x86_64                             
863  perl-Encode-devel-4:2.98-6.fc29.x86_64                           perl-Env-1.04-417.fc29.noarch                                perl-Exporter-5.73-418.fc29.noarch                           
864  perl-ExtUtils-CBuilder-1:0.280230-417.fc29.noarch                perl-ExtUtils-Command-1:7.34-418.fc29.noarch                 perl-ExtUtils-Install-2.14-418.fc29.noarch                   
865  perl-ExtUtils-MM-Utils-1:7.34-418.fc29.noarch                    perl-ExtUtils-MakeMaker-1:7.34-418.fc29.noarch               perl-ExtUtils-Manifest-1:1.71-3.fc29.noarch                 
866  perl-File-Fetch-0.56-417.fc29.noarch                             perl-File-HomeDir-1.004-3.fc29.noarch                        perl-File-Path-2.16-1.fc29.noarch                           
867  perl-File-Temp-1:0.230.800-2.fc29.noarch                         perl-File-Which-1.22-4.fc29.noarch                           perl-Filter-2:1.59-1.fc29.x86_64                             
868  perl-Filter-Simple-0.95-417.fc29.noarch                          perl-Getopt-Long-1:2.50-417.fc29.noarch                      perl-HTTP-Tiny-0.076-1.fc29.noarch                           
869  perl-IO-Compress-2.081-5.fc29.noarch                             perl-IO-Socket-IP-0.39-418.fc29.noarch                       perl-IPC-Cmd-2:1.02-4.fc29.noarch                           
870  perl-IPC-SysV-2.07-418.fc29.x86_64                               perl-IPC-System-Simple-1.25-20.fc29.noarch                   perl-JSON-PP-1:2.97.001-418.fc29.noarch                     
871  perl-Locale-Maketext-1.29-418.fc29.noarch                        perl-MIME-Base64-3.15-417.fc29.x86_64                        perl-MRO-Compat-0.13-6.fc29.noarch                           
872  perl-Math-BigInt-1:1.9998.13-3.fc29.noarch                       perl-Math-BigInt-FastCalc-0.500.700-3.fc29.x86_64            perl-Math-BigRat-0.2614-3.fc29.noarch                       
873  perl-Module-Build-2:0.42.24-10.fc29.noarch                       perl-Module-Load-1:0.32-417.fc29.noarch                      perl-Module-Load-Conditional-0.68-417.fc29.noarch           
874  perl-Module-Metadata-1.000033-417.fc29.noarch                    perl-Net-SSLeay-1.85-8.fc29.x86_64                           perl-Package-Generator-1.106-13.fc29.noarch                 
875  perl-Params-Check-1:0.38-417.fc29.noarch                         perl-Params-Util-1.07-25.fc29.x86_64                         perl-PathTools-3.75-1.fc29.x86_64                           
876  perl-Perl-OSType-1.010-418.fc29.noarch                           perl-PerlIO-via-QuotedPrint-0.08-417.fc29.noarch             perl-Pod-Checker-4:1.73-417.fc29.noarch                     
877  perl-Pod-Escapes-1:1.07-417.fc29.noarch                          perl-Pod-Parser-1.63-418.fc29.noarch                         perl-Pod-Perldoc-3.28.01-418.fc29.noarch                     
878  perl-Pod-Simple-1:3.35-417.fc29.noarch                           perl-Pod-Usage-4:1.69-417.fc29.noarch                        perl-Scalar-List-Utils-3:1.50-417.fc29.x86_64               
879  perl-Socket-4:2.027-417.fc29.x86_64                              perl-Software-License-0.103013-5.fc29.noarch                 perl-Storable-1:3.11-5.fc29.x86_64                           
880  perl-Sub-Exporter-0.987-17.fc29.noarch                           perl-Sub-Install-0.928-17.fc29.noarch                        perl-Sys-Syslog-0.35-418.fc29.x86_64                         
881  perl-Term-ANSIColor-4.06-418.fc29.noarch                         perl-Term-Cap-1.17-417.fc29.noarch                           perl-Test-Harness-1:3.42-418.fc29.noarch                     
882  perl-Test-Simple-2:1.302140-1.fc29.noarch                        perl-Text-Balanced-2.03-417.fc29.noarch                      perl-Text-Diff-1.45-4.fc29.noarch                           
883  perl-Text-Glob-0.11-6.fc29.noarch                                perl-Text-ParseWords-3.30-417.fc29.noarch                    perl-Text-Tabs+Wrap-2013.0523-417.fc29.noarch               
884  perl-Text-Template-1.53-3.fc29.noarch                            perl-Thread-Queue-3.13-1.fc29.noarch                         perl-Time-HiRes-1.9759-417.fc29.x86_64                       
885  perl-Time-Local-2:1.280-3.fc29.noarch                            perl-URI-1.74-4.fc29.noarch                                  perl-Unicode-Collate-1.25-417.fc29.x86_64                   
886  perl-Unicode-Normalize-1.26-417.fc29.x86_64                      perl-autodie-2.29-418.fc29.noarch                            perl-constant-1.33-418.fc29.noarch                           
887  perl-encoding-4:2.22-6.fc29.x86_64                               perl-experimental-0.020-3.fc29.noarch                        perl-inc-latest-2:0.500-11.fc29.noarch                       
888  perl-libnet-3.11-418.fc29.noarch                                 perl-local-lib-2.000024-4.fc29.noarch                        perl-parent-1:0.237-2.fc29.noarch                           
889  perl-perlfaq-5.20180915-1.fc29.noarch                            perl-podlators-1:4.11-3.fc29.noarch                          perl-srpm-macros-1-28.fc29.noarch                           
890  perl-threads-1:2.22-417.fc29.x86_64                              perl-version-7:0.99.24-5.fc29.x86_64                         pkgconf-1.5.3-2.fc29.x86_64                                 
891  pkgconf-m4-1.5.3-2.fc29.noarch                                   pkgconf-pkg-config-1.5.3-2.fc29.x86_64                       python-srpm-macros-3-37.fc29.noarch                         
892  python3-pyparsing-2.2.0-3.fc29.noarch                            qt5-srpm-macros-5.11.1-4.fc29.noarch                         redhat-rpm-config-118-1.fc29.noarch                         
893  rhash-1.3.5-3.fc29.x86_64                                        rust-srpm-macros-6-1.fc29.noarch                             zip-3.0-23.fc29.x86_64                                       
894
895Complete!
896[kdudka@f29 divine-4.1.20]$ make
897-- The C compiler identification is GNU 8.2.1
898-- The CXX compiler identification is GNU 8.2.1
899-- Check for working C compiler: /usr/bin/cc
900-- Check for working C compiler: /usr/bin/cc -- works
901-- Detecting C compiler ABI info
902-- Detecting C compiler ABI info - done
903-- Detecting C compile features
904-- Detecting C compile features - done
905-- Check for working CXX compiler: /usr/bin/g++
906-- Check for working CXX compiler: /usr/bin/g++ -- works
907-- Detecting CXX compiler ABI info
908-- Detecting CXX compiler ABI info - done
909-- Detecting CXX compile features
910-- Detecting CXX compile features - done
911-- Looking for dirent.h
912CMake Warning (dev) at /usr/share/cmake/Modules/CheckIncludeFile.cmake:70 (message):
913  Policy CMP0075 is not set: Include file check macros honor
914  CMAKE_REQUIRED_LIBRARIES.  Run "cmake --help-policy CMP0075" for policy
915  details.  Use the cmake_policy command to set the policy and suppress this
916  warning.
917
918  CMAKE_REQUIRED_LIBRARIES is set to:
919
920    m
921
922  For compatibility with CMake 3.11 and below this check is ignoring it.
923Call Stack (most recent call first):
924  llvm/cmake/config-ix.cmake:46 (check_include_file)
925  CMakeLists.txt:104 (include)
926  CMakeLists.txt:137 (build_llvm)
927This warning is for project developers.  Use -Wno-dev to suppress it.
928
929-- Looking for dirent.h - found
930-- Looking for dlfcn.h
931-- Looking for dlfcn.h - found
932-- Looking for errno.h
933-- Looking for errno.h - found
934-- Looking for fcntl.h
935-- Looking for fcntl.h - found
936-- Looking for inttypes.h
937-- Looking for inttypes.h - found
938-- Looking for link.h
939-- Looking for link.h - found
940-- Looking for malloc.h
941-- Looking for malloc.h - found
942-- Looking for malloc/malloc.h
943-- Looking for malloc/malloc.h - not found
944-- Looking for ndir.h
945-- Looking for ndir.h - not found
946-- Looking for pthread.h
947-- Looking for pthread.h - found
948-- Looking for signal.h
949-- Looking for signal.h - found
950-- Looking for stdint.h
951-- Looking for stdint.h - found
952-- Looking for sys/dir.h
953-- Looking for sys/dir.h - found
954-- Looking for sys/ioctl.h
955-- Looking for sys/ioctl.h - found
956-- Looking for sys/mman.h
957-- Looking for sys/mman.h - found
958-- Looking for sys/ndir.h
959-- Looking for sys/ndir.h - not found
960-- Looking for sys/param.h
961-- Looking for sys/param.h - found
962-- Looking for sys/resource.h
963-- Looking for sys/resource.h - found
964-- Looking for sys/stat.h
965-- Looking for sys/stat.h - found
966-- Looking for sys/time.h
967-- Looking for sys/time.h - found
968-- Looking for sys/types.h
969-- Looking for sys/types.h - found
970-- Looking for sys/uio.h
971-- Looking for sys/uio.h - found
972-- Looking for termios.h
973-- Looking for termios.h - found
974-- Looking for unistd.h
975-- Looking for unistd.h - found
976-- Looking for valgrind/valgrind.h
977-- Looking for valgrind/valgrind.h - not found
978-- Looking for zlib.h
979-- Looking for zlib.h - found
980-- Looking for fenv.h
981-- Looking for fenv.h - found
982-- Looking for FE_ALL_EXCEPT
983-- Looking for FE_ALL_EXCEPT - found
984-- Looking for FE_INEXACT
985-- Looking for FE_INEXACT - found
986-- Looking for mach/mach.h
987-- Looking for mach/mach.h - not found
988-- Looking for histedit.h
989-- Looking for histedit.h - found
990-- Looking for CrashReporterClient.h
991-- Looking for CrashReporterClient.h - not found
992-- Looking for linux/magic.h
993-- Looking for linux/magic.h - found
994-- Looking for pthread_create in pthread
995-- Looking for pthread_create in pthread - found
996-- Looking for pthread_getspecific in pthread
997-- Looking for pthread_getspecific in pthread - found
998-- Looking for pthread_rwlock_init in pthread
999-- Looking for pthread_rwlock_init in pthread - found
1000-- Looking for pthread_mutex_lock in pthread
1001-- Looking for pthread_mutex_lock in pthread - found
1002-- Looking for dlopen in dl
1003-- Looking for dlopen in dl - found
1004-- Looking for clock_gettime in rt
1005-- Looking for clock_gettime in rt - found
1006-- Looking for pthread.h
1007-- Looking for pthread.h - found
1008-- Looking for pthread_create
1009-- Looking for pthread_create - not found
1010-- Looking for pthread_create in pthreads
1011-- Looking for pthread_create in pthreads - not found
1012-- Looking for pthread_create in pthread
1013-- Looking for pthread_create in pthread - found
1014-- Found Threads: TRUE 
1015-- Looking for xar_open in xar
1016-- Looking for xar_open in xar - not found
1017-- Looking for arc4random
1018-- Looking for arc4random - not found
1019-- Looking for backtrace
1020-- Looking for backtrace - found
1021-- backtrace facility detected in default set of libraries
1022-- Found Backtrace: /usr/include 
1023-- Looking for _Unwind_Backtrace
1024-- Looking for _Unwind_Backtrace - found
1025-- Looking for getpagesize
1026-- Looking for getpagesize - found
1027-- Looking for sysconf
1028-- Looking for sysconf - found
1029-- Looking for getrusage
1030-- Looking for getrusage - found
1031-- Looking for setrlimit
1032-- Looking for setrlimit - found
1033-- Looking for isatty
1034-- Looking for isatty - found
1035-- Looking for futimens
1036-- Looking for futimens - found
1037-- Looking for futimes
1038-- Looking for futimes - found
1039-- Looking for posix_fallocate
1040-- Looking for posix_fallocate - found
1041-- Looking for sigaltstack
1042-- Looking for sigaltstack - found
1043-- Looking for writev
1044-- Looking for writev - found
1045-- Looking for lseek64
1046-- Looking for lseek64 - found
1047-- Looking for mallctl
1048-- Looking for mallctl - not found
1049-- Looking for mallinfo
1050-- Looking for mallinfo - found
1051-- Looking for malloc_zone_statistics
1052-- Looking for malloc_zone_statistics - not found
1053-- Looking for mkdtemp
1054-- Looking for mkdtemp - found
1055-- Looking for mkstemp
1056-- Looking for mkstemp - found
1057-- Looking for mktemp
1058-- Looking for mktemp - found
1059-- Looking for getcwd
1060-- Looking for getcwd - found
1061-- Looking for gettimeofday
1062-- Looking for gettimeofday - found
1063-- Looking for getrlimit
1064-- Looking for getrlimit - found
1065-- Looking for posix_spawn
1066-- Looking for posix_spawn - found
1067-- Looking for pread
1068-- Looking for pread - found
1069-- Looking for realpath
1070-- Looking for realpath - found
1071-- Looking for sbrk
1072-- Looking for sbrk - found
1073-- Looking for strtoll
1074-- Looking for strtoll - found
1075-- Looking for strerror
1076-- Looking for strerror - found
1077-- Looking for strerror_r
1078-- Looking for strerror_r - found
1079-- Looking for strerror_s
1080-- Looking for strerror_s - not found
1081-- Looking for setenv
1082-- Looking for setenv - found
1083-- Looking for dlopen
1084-- Looking for dlopen - found
1085-- Looking for dladdr
1086-- Looking for dladdr - not found
1087-- Looking for __GLIBC__
1088-- Looking for __GLIBC__ - found
1089-- Looking for pthread_getname_np in pthread
1090-- Looking for pthread_getname_np in pthread - found
1091-- Looking for pthread_setname_np in pthread
1092-- Looking for pthread_setname_np in pthread - found
1093-- Performing Test HAVE_INT64_T
1094-- Performing Test HAVE_INT64_T - Success
1095-- Performing Test HAVE_UINT64_T
1096-- Performing Test HAVE_UINT64_T - Success
1097-- Performing Test HAVE_U_INT64_T
1098-- Performing Test HAVE_U_INT64_T - Success
1099-- Performing Test HAVE_CXX_ATOMICS_WITHOUT_LIB
1100-- Performing Test HAVE_CXX_ATOMICS_WITHOUT_LIB - Success
1101-- Performing Test HAVE_CXX_ATOMICS64_WITHOUT_LIB
1102-- Performing Test HAVE_CXX_ATOMICS64_WITHOUT_LIB - Success
1103-- Performing Test LLVM_HAS_ATOMICS
1104-- Performing Test LLVM_HAS_ATOMICS - Success
1105-- Performing Test SUPPORTS_NO_PIE_FLAG
1106-- Performing Test SUPPORTS_NO_PIE_FLAG - Success
1107-- Performing Test SUPPORTS_VARIADIC_MACROS_FLAG
1108-- Performing Test SUPPORTS_VARIADIC_MACROS_FLAG - Success
1109-- Performing Test SUPPORTS_GNU_ZERO_VARIADIC_MACRO_ARGUMENTS_FLAG
1110-- Performing Test SUPPORTS_GNU_ZERO_VARIADIC_MACRO_ARGUMENTS_FLAG - Failed
1111-- Performing Test HAS_MAYBE_UNINITIALIZED
1112-- Performing Test HAS_MAYBE_UNINITIALIZED - Success
1113-- Native target X86 is not selected; lli will not JIT code
1114-- Threads disabled.
1115-- Doxygen disabled.
1116-- Linker detection: GNU ld
1117-- Performing Test C_SUPPORTS_WERROR_DATE_TIME
1118-- Performing Test C_SUPPORTS_WERROR_DATE_TIME - Success
1119-- Performing Test CXX_SUPPORTS_WERROR_DATE_TIME
1120-- Performing Test CXX_SUPPORTS_WERROR_DATE_TIME - Success
1121-- Performing Test CXX_SUPPORTS_CXX11
1122-- Performing Test CXX_SUPPORTS_CXX11 - Success
1123-- Performing Test CXX_SUPPORTS_MISSING_FIELD_INITIALIZERS_FLAG
1124-- Performing Test CXX_SUPPORTS_MISSING_FIELD_INITIALIZERS_FLAG - Success
1125-- Performing Test C_SUPPORTS_COVERED_SWITCH_DEFAULT_FLAG
1126-- Performing Test C_SUPPORTS_COVERED_SWITCH_DEFAULT_FLAG - Failed
1127-- Performing Test CXX_SUPPORTS_COVERED_SWITCH_DEFAULT_FLAG
1128-- Performing Test CXX_SUPPORTS_COVERED_SWITCH_DEFAULT_FLAG - Failed
1129-- Performing Test C_SUPPORTS_DELETE_NON_VIRTUAL_DTOR_FLAG
1130-- Performing Test C_SUPPORTS_DELETE_NON_VIRTUAL_DTOR_FLAG - Failed
1131-- Performing Test CXX_SUPPORTS_DELETE_NON_VIRTUAL_DTOR_FLAG
1132-- Performing Test CXX_SUPPORTS_DELETE_NON_VIRTUAL_DTOR_FLAG - Success
1133-- Performing Test C_WCOMMENT_ALLOWS_LINE_WRAP
1134-- Performing Test C_WCOMMENT_ALLOWS_LINE_WRAP - Failed
1135-- Performing Test C_SUPPORTS_STRING_CONVERSION_FLAG
1136-- Performing Test C_SUPPORTS_STRING_CONVERSION_FLAG - Failed
1137-- Performing Test CXX_SUPPORTS_STRING_CONVERSION_FLAG
1138-- Performing Test CXX_SUPPORTS_STRING_CONVERSION_FLAG - Failed
1139-- Performing Test LINKER_SUPPORTS_COLOR_DIAGNOSTICS
1140-- Performing Test LINKER_SUPPORTS_COLOR_DIAGNOSTICS - Failed
1141-- Performing Test C_SUPPORTS_FNO_FUNCTION_SECTIONS
1142-- Performing Test C_SUPPORTS_FNO_FUNCTION_SECTIONS - Success
1143-- Performing Test C_SUPPORTS_FFUNCTION_SECTIONS
1144-- Performing Test C_SUPPORTS_FFUNCTION_SECTIONS - Success
1145-- Performing Test CXX_SUPPORTS_FFUNCTION_SECTIONS
1146-- Performing Test CXX_SUPPORTS_FFUNCTION_SECTIONS - Success
1147-- Performing Test C_SUPPORTS_FDATA_SECTIONS
1148-- Performing Test C_SUPPORTS_FDATA_SECTIONS - Success
1149-- Performing Test CXX_SUPPORTS_FDATA_SECTIONS
1150-- Performing Test CXX_SUPPORTS_FDATA_SECTIONS - Success
1151CMake Deprecation Warning at llvm/CMakeLists.txt:15 (cmake_policy):
1152  The OLD behavior for policy CMP0051 will be removed from a future version
1153  of CMake.
1154
1155  The cmake-policies(7) manual explains that the OLD behaviors of all
1156  policies are deprecated and that a policy should be set to OLD only under
1157  specific short-term circumstances.  Projects should be ported to the NEW
1158  behavior and not rely on setting a policy to OLD.
1159
1160
1161-- The ASM compiler identification is GNU
1162-- Found assembler: /usr/bin/cc
1163-- Looking for setupterm in tinfo
1164-- Looking for setupterm in tinfo - found
1165-- Native target architecture is X86
1166-- Threads enabled.
1167-- Doxygen disabled.
1168-- LLVM host triple: x86_64-unknown-linux-gnu
1169-- LLVM default target triple: x86_64-unknown-linux-gnu
1170-- Found PythonInterp: /usr/bin/python2.7 (found version "2.7.15")
1171-- Constructing LLVMBuild project information
1172-- Linker detection: GNU ld
1173-- Targeting AArch64
1174-- Targeting AMDGPU
1175-- Targeting ARM
1176-- Targeting BPF
1177-- Targeting Hexagon
1178-- Targeting Lanai
1179-- Targeting Mips
1180-- Targeting MSP430
1181-- Targeting NVPTX
1182-- Targeting PowerPC
1183-- Targeting Sparc
1184-- Targeting SystemZ
1185-- Targeting X86
1186-- Targeting XCore
1187-- Could NOT find Z3 (missing: Z3_LIBRARY Z3_INCLUDE_DIR) (Required is at least version "4.5")
1188-- Looking for sys/resource.h
1189-- Looking for sys/resource.h - found
1190-- Clang version: 5.0.0
1191-- Performing Test CXX_SUPPORTS_NO_NESTED_ANON_TYPES_FLAG
1192-- Performing Test CXX_SUPPORTS_NO_NESTED_ANON_TYPES_FLAG - Failed
1193-- LLD version: 5.0.0
1194-- Looking for unwind.h
1195-- Looking for unwind.h - found
1196-- Performing Test COMPILER_RT_HAS_FPIC_FLAG
1197-- Performing Test COMPILER_RT_HAS_FPIC_FLAG - Success
1198-- Performing Test COMPILER_RT_HAS_FPIE_FLAG
1199-- Performing Test COMPILER_RT_HAS_FPIE_FLAG - Success
1200-- Performing Test COMPILER_RT_HAS_FNO_BUILTIN_FLAG
1201-- Performing Test COMPILER_RT_HAS_FNO_BUILTIN_FLAG - Success
1202-- Performing Test COMPILER_RT_HAS_FNO_EXCEPTIONS_FLAG
1203-- Performing Test COMPILER_RT_HAS_FNO_EXCEPTIONS_FLAG - Success
1204-- Performing Test COMPILER_RT_HAS_FOMIT_FRAME_POINTER_FLAG
1205-- Performing Test COMPILER_RT_HAS_FOMIT_FRAME_POINTER_FLAG - Success
1206-- Performing Test COMPILER_RT_HAS_FUNWIND_TABLES_FLAG
1207-- Performing Test COMPILER_RT_HAS_FUNWIND_TABLES_FLAG - Success
1208-- Performing Test COMPILER_RT_HAS_FNO_STACK_PROTECTOR_FLAG
1209-- Performing Test COMPILER_RT_HAS_FNO_STACK_PROTECTOR_FLAG - Success
1210-- Performing Test COMPILER_RT_HAS_FNO_SANITIZE_SAFE_STACK_FLAG
1211-- Performing Test COMPILER_RT_HAS_FNO_SANITIZE_SAFE_STACK_FLAG - Failed
1212-- Performing Test COMPILER_RT_HAS_FVISIBILITY_HIDDEN_FLAG
1213-- Performing Test COMPILER_RT_HAS_FVISIBILITY_HIDDEN_FLAG - Success
1214-- Performing Test COMPILER_RT_HAS_FNO_RTTI_FLAG
1215-- Performing Test COMPILER_RT_HAS_FNO_RTTI_FLAG - Success
1216-- Performing Test COMPILER_RT_HAS_FFREESTANDING_FLAG
1217-- Performing Test COMPILER_RT_HAS_FFREESTANDING_FLAG - Success
1218-- Performing Test COMPILER_RT_HAS_FNO_FUNCTION_SECTIONS_FLAG
1219-- Performing Test COMPILER_RT_HAS_FNO_FUNCTION_SECTIONS_FLAG - Success
1220-- Performing Test COMPILER_RT_HAS_STD_CXX11_FLAG
1221-- Performing Test COMPILER_RT_HAS_STD_CXX11_FLAG - Success
1222-- Performing Test COMPILER_RT_HAS_FTLS_MODEL_INITIAL_EXEC
1223-- Performing Test COMPILER_RT_HAS_FTLS_MODEL_INITIAL_EXEC - Success
1224-- Performing Test COMPILER_RT_HAS_FNO_LTO_FLAG
1225-- Performing Test COMPILER_RT_HAS_FNO_LTO_FLAG - Success
1226-- Performing Test COMPILER_RT_HAS_MSSE3_FLAG
1227-- Performing Test COMPILER_RT_HAS_MSSE3_FLAG - Success
1228-- Performing Test COMPILER_RT_HAS_GR_FLAG
1229-- Performing Test COMPILER_RT_HAS_GR_FLAG - Failed
1230-- Performing Test COMPILER_RT_HAS_GS_FLAG
1231-- Performing Test COMPILER_RT_HAS_GS_FLAG - Failed
1232-- Performing Test COMPILER_RT_HAS_MT_FLAG
1233-- Performing Test COMPILER_RT_HAS_MT_FLAG - Failed
1234-- Performing Test COMPILER_RT_HAS_Oy_FLAG
1235-- Performing Test COMPILER_RT_HAS_Oy_FLAG - Failed
1236-- Performing Test COMPILER_RT_HAS_GLINE_TABLES_ONLY_FLAG
1237-- Performing Test COMPILER_RT_HAS_GLINE_TABLES_ONLY_FLAG - Failed
1238-- Performing Test COMPILER_RT_HAS_G_FLAG
1239-- Performing Test COMPILER_RT_HAS_G_FLAG - Success
1240-- Performing Test COMPILER_RT_HAS_Zi_FLAG
1241-- Performing Test COMPILER_RT_HAS_Zi_FLAG - Failed
1242-- Performing Test COMPILER_RT_HAS_WALL_FLAG
1243-- Performing Test COMPILER_RT_HAS_WALL_FLAG - Success
1244-- Performing Test COMPILER_RT_HAS_WERROR_FLAG
1245-- Performing Test COMPILER_RT_HAS_WERROR_FLAG - Success
1246-- Performing Test COMPILER_RT_HAS_WFRAME_LARGER_THAN_FLAG
1247-- Performing Test COMPILER_RT_HAS_WFRAME_LARGER_THAN_FLAG - Success
1248-- Performing Test COMPILER_RT_HAS_WGLOBAL_CONSTRUCTORS_FLAG
1249-- Performing Test COMPILER_RT_HAS_WGLOBAL_CONSTRUCTORS_FLAG - Failed
1250-- Performing Test COMPILER_RT_HAS_WC99_EXTENSIONS_FLAG
1251-- Performing Test COMPILER_RT_HAS_WC99_EXTENSIONS_FLAG - Failed
1252-- Performing Test COMPILER_RT_HAS_WGNU_FLAG
1253-- Performing Test COMPILER_RT_HAS_WGNU_FLAG - Failed
1254-- Performing Test COMPILER_RT_HAS_WNON_VIRTUAL_DTOR_FLAG
1255-- Performing Test COMPILER_RT_HAS_WNON_VIRTUAL_DTOR_FLAG - Success
1256-- Performing Test COMPILER_RT_HAS_WVARIADIC_MACROS_FLAG
1257-- Performing Test COMPILER_RT_HAS_WVARIADIC_MACROS_FLAG - Success
1258-- Performing Test COMPILER_RT_HAS_W3_FLAG
1259-- Performing Test COMPILER_RT_HAS_W3_FLAG - Failed
1260-- Performing Test COMPILER_RT_HAS_WX_FLAG
1261-- Performing Test COMPILER_RT_HAS_WX_FLAG - Failed
1262-- Performing Test COMPILER_RT_HAS_WD4146_FLAG
1263-- Performing Test COMPILER_RT_HAS_WD4146_FLAG - Failed
1264-- Performing Test COMPILER_RT_HAS_WD4291_FLAG
1265-- Performing Test COMPILER_RT_HAS_WD4291_FLAG - Failed
1266-- Performing Test COMPILER_RT_HAS_WD4391_FLAG
1267-- Performing Test COMPILER_RT_HAS_WD4391_FLAG - Failed
1268-- Performing Test COMPILER_RT_HAS_WD4722_FLAG
1269-- Performing Test COMPILER_RT_HAS_WD4722_FLAG - Failed
1270-- Performing Test COMPILER_RT_HAS_WD4800_FLAG
1271-- Performing Test COMPILER_RT_HAS_WD4800_FLAG - Failed
1272-- Looking for __func__
1273-- Looking for __func__ - found
1274-- Looking for printf in c
1275-- Looking for printf in c - found
1276-- Looking for dlopen in dl
1277-- Looking for dlopen in dl - found
1278-- Looking for shm_open in rt
1279-- Looking for shm_open in rt - found
1280-- Looking for pow in m
1281-- Looking for pow in m - found
1282-- Looking for pthread_create in pthread
1283-- Looking for pthread_create in pthread - found
1284-- Looking for __cxa_throw in stdc++
1285-- Looking for __cxa_throw in stdc++ - found
1286-- Looking for __i686__
1287-- Looking for __i686__ - not found
1288-- Looking for __i386__
1289-- Looking for __i386__ - not found
1290-- Compiler-RT supported architectures: x86_64
1291-- Linker detection: GNU ld
1292-- Looking for rpc/xdr.h
1293-- Looking for rpc/xdr.h - not found
1294-- Looking for tirpc/rpc/xdr.h
1295-- Looking for tirpc/rpc/xdr.h - not found
1296-- Performing Test LIBUNWIND_HAS_FUNWIND_TABLES
1297-- Performing Test LIBUNWIND_HAS_FUNWIND_TABLES - Success
1298-- Performing Test LIBUNWIND_HAS_FPIC_FLAG
1299-- Performing Test LIBUNWIND_HAS_FPIC_FLAG - Success
1300-- Performing Test LIBUNWIND_HAS_NO_EXCEPTIONS_FLAG
1301-- Performing Test LIBUNWIND_HAS_NO_EXCEPTIONS_FLAG - Success
1302-- Performing Test LIBUNWIND_HAS_NO_RTTI_FLAG
1303-- Performing Test LIBUNWIND_HAS_NO_RTTI_FLAG - Success
1304-- Performing Test LIBUNWIND_HAS_FSTRICT_ALIASING_FLAG
1305-- Performing Test LIBUNWIND_HAS_FSTRICT_ALIASING_FLAG - Success
1306-- Performing Test LIBUNWIND_HAS_NODEFAULTLIBS_FLAG
1307-- Performing Test LIBUNWIND_HAS_NODEFAULTLIBS_FLAG - Success
1308-- Performing Test LIBUNWIND_HAS_NOSTDINCXX_FLAG
1309-- Performing Test LIBUNWIND_HAS_NOSTDINCXX_FLAG - Success
1310-- Performing Test LIBUNWIND_HAS_WALL_FLAG
1311-- Performing Test LIBUNWIND_HAS_WALL_FLAG - Success
1312-- Performing Test LIBUNWIND_HAS_W_FLAG
1313-- Performing Test LIBUNWIND_HAS_W_FLAG - Success
1314-- Performing Test LIBUNWIND_HAS_WNO_UNUSED_FUNCTION_FLAG
1315-- Performing Test LIBUNWIND_HAS_WNO_UNUSED_FUNCTION_FLAG - Success
1316-- Performing Test LIBUNWIND_HAS_WUNUSED_VARIABLE_FLAG
1317-- Performing Test LIBUNWIND_HAS_WUNUSED_VARIABLE_FLAG - Success
1318-- Performing Test LIBUNWIND_HAS_WUNUSED_PARAMETER_FLAG
1319-- Performing Test LIBUNWIND_HAS_WUNUSED_PARAMETER_FLAG - Success
1320-- Performing Test LIBUNWIND_HAS_WSTRICT_ALIASING_FLAG
1321-- Performing Test LIBUNWIND_HAS_WSTRICT_ALIASING_FLAG - Success
1322-- Performing Test LIBUNWIND_HAS_WSTRICT_OVERFLOW_FLAG
1323-- Performing Test LIBUNWIND_HAS_WSTRICT_OVERFLOW_FLAG - Success
1324-- Performing Test LIBUNWIND_HAS_WWRITE_STRINGS_FLAG
1325-- Performing Test LIBUNWIND_HAS_WWRITE_STRINGS_FLAG - Success
1326-- Performing Test LIBUNWIND_HAS_WCHAR_SUBSCRIPTS_FLAG
1327-- Performing Test LIBUNWIND_HAS_WCHAR_SUBSCRIPTS_FLAG - Success
1328-- Performing Test LIBUNWIND_HAS_WMISMATCHED_TAGS_FLAG
1329-- Performing Test LIBUNWIND_HAS_WMISMATCHED_TAGS_FLAG - Failed
1330-- Performing Test LIBUNWIND_HAS_WMISSING_BRACES_FLAG
1331-- Performing Test LIBUNWIND_HAS_WMISSING_BRACES_FLAG - Success
1332-- Performing Test LIBUNWIND_HAS_WSHORTEN_64_TO_32_FLAG
1333-- Performing Test LIBUNWIND_HAS_WSHORTEN_64_TO_32_FLAG - Failed
1334-- Performing Test LIBUNWIND_HAS_WSIGN_CONVERSION_FLAG
1335-- Performing Test LIBUNWIND_HAS_WSIGN_CONVERSION_FLAG - Success
1336-- Performing Test LIBUNWIND_HAS_WSIGN_COMPARE_FLAG
1337-- Performing Test LIBUNWIND_HAS_WSIGN_COMPARE_FLAG - Success
1338-- Performing Test LIBUNWIND_HAS_WSHADOW_FLAG
1339-- Performing Test LIBUNWIND_HAS_WSHADOW_FLAG - Success
1340-- Performing Test LIBUNWIND_HAS_WCONVERSION_FLAG
1341-- Performing Test LIBUNWIND_HAS_WCONVERSION_FLAG - Success
1342-- Performing Test LIBUNWIND_HAS_WNEWLINE_EOF_FLAG
1343-- Performing Test LIBUNWIND_HAS_WNEWLINE_EOF_FLAG - Failed
1344-- Performing Test LIBUNWIND_HAS_WUNDEF_FLAG
1345-- Performing Test LIBUNWIND_HAS_WUNDEF_FLAG - Success
1346-- Performing Test LIBUNWIND_HAS_PEDANTIC_FLAG
1347-- Performing Test LIBUNWIND_HAS_PEDANTIC_FLAG - Success
1348-- Performing Test LIBUNWIND_HAS_WERROR_FLAG
1349-- Performing Test LIBUNWIND_HAS_WERROR_FLAG - Success
1350-- Performing Test LIBUNWIND_HAS_WNO_ERROR_FLAG
1351-- Performing Test LIBUNWIND_HAS_WNO_ERROR_FLAG - Success
1352-- Performing Test LIBUNWIND_HAS_WX_FLAG
1353-- Performing Test LIBUNWIND_HAS_WX_FLAG - Failed
1354-- Performing Test LIBUNWIND_HAS_NO_WX_FLAG
1355-- Performing Test LIBUNWIND_HAS_NO_WX_FLAG - Failed
1356-- Performing Test LIBUNWIND_HAS_EHSC_FLAG
1357-- Performing Test LIBUNWIND_HAS_EHSC_FLAG - Failed
1358-- Performing Test LIBUNWIND_HAS_NO_EHS_FLAG
1359-- Performing Test LIBUNWIND_HAS_NO_EHS_FLAG - Failed
1360-- Performing Test LIBUNWIND_HAS_NO_EHA_FLAG
1361-- Performing Test LIBUNWIND_HAS_NO_EHA_FLAG - Failed
1362-- Performing Test LIBUNWIND_HAS_NO_GR_FLAG
1363-- Performing Test LIBUNWIND_HAS_NO_GR_FLAG - Failed
1364-- Performing Test LIBUNWIND_HAS_STD_CXX11
1365-- Performing Test LIBUNWIND_HAS_STD_CXX11 - Success
1366-- Looking for fopen in c
1367-- Looking for fopen in c - found
1368-- Looking for dladdr in dl
1369-- Looking for dladdr in dl - found
1370-- Looking for pthread_once in pthread
1371-- Looking for pthread_once in pthread - found
1372-- Performing Test LIBCXXABI_HAS_FUNWIND_TABLES
1373-- Performing Test LIBCXXABI_HAS_FUNWIND_TABLES - Success
1374-- Performing Test LIBCXXABI_HAS_FPIC_FLAG
1375-- Performing Test LIBCXXABI_HAS_FPIC_FLAG - Success
1376-- Performing Test LIBCXXABI_HAS_NO_EXCEPTIONS_FLAG
1377-- Performing Test LIBCXXABI_HAS_NO_EXCEPTIONS_FLAG - Success
1378-- Performing Test LIBCXXABI_HAS_NO_RTTI_FLAG
1379-- Performing Test LIBCXXABI_HAS_NO_RTTI_FLAG - Success
1380-- Performing Test LIBCXXABI_HAS_FSTRICT_ALIASING_FLAG
1381-- Performing Test LIBCXXABI_HAS_FSTRICT_ALIASING_FLAG - Success
1382-- Performing Test LIBCXXABI_HAS_NODEFAULTLIBS_FLAG
1383-- Performing Test LIBCXXABI_HAS_NODEFAULTLIBS_FLAG - Success
1384-- Performing Test LIBCXXABI_HAS_NOSTDINCXX_FLAG
1385-- Performing Test LIBCXXABI_HAS_NOSTDINCXX_FLAG - Success
1386-- Performing Test LIBCXXABI_HAS_WALL_FLAG
1387-- Performing Test LIBCXXABI_HAS_WALL_FLAG - Success
1388-- Performing Test LIBCXXABI_HAS_W_FLAG
1389-- Performing Test LIBCXXABI_HAS_W_FLAG - Success
1390-- Performing Test LIBCXXABI_HAS_WNO_UNUSED_FUNCTION_FLAG
1391-- Performing Test LIBCXXABI_HAS_WNO_UNUSED_FUNCTION_FLAG - Success
1392-- Performing Test LIBCXXABI_HAS_WUNUSED_VARIABLE_FLAG
1393-- Performing Test LIBCXXABI_HAS_WUNUSED_VARIABLE_FLAG - Success
1394-- Performing Test LIBCXXABI_HAS_WUNUSED_PARAMETER_FLAG
1395-- Performing Test LIBCXXABI_HAS_WUNUSED_PARAMETER_FLAG - Success
1396-- Performing Test LIBCXXABI_HAS_WSTRICT_ALIASING_FLAG
1397-- Performing Test LIBCXXABI_HAS_WSTRICT_ALIASING_FLAG - Success
1398-- Performing Test LIBCXXABI_HAS_WSTRICT_OVERFLOW_FLAG
1399-- Performing Test LIBCXXABI_HAS_WSTRICT_OVERFLOW_FLAG - Success
1400-- Performing Test LIBCXXABI_HAS_WWRITE_STRINGS_FLAG
1401-- Performing Test LIBCXXABI_HAS_WWRITE_STRINGS_FLAG - Success
1402-- Performing Test LIBCXXABI_HAS_WCHAR_SUBSCRIPTS_FLAG
1403-- Performing Test LIBCXXABI_HAS_WCHAR_SUBSCRIPTS_FLAG - Success
1404-- Performing Test LIBCXXABI_HAS_WMISMATCHED_TAGS_FLAG
1405-- Performing Test LIBCXXABI_HAS_WMISMATCHED_TAGS_FLAG - Failed
1406-- Performing Test LIBCXXABI_HAS_WMISSING_BRACES_FLAG
1407-- Performing Test LIBCXXABI_HAS_WMISSING_BRACES_FLAG - Success
1408-- Performing Test LIBCXXABI_HAS_WSHORTEN_64_TO_32_FLAG
1409-- Performing Test LIBCXXABI_HAS_WSHORTEN_64_TO_32_FLAG - Failed
1410-- Performing Test LIBCXXABI_HAS_WSIGN_CONVERSION_FLAG
1411-- Performing Test LIBCXXABI_HAS_WSIGN_CONVERSION_FLAG - Success
1412-- Performing Test LIBCXXABI_HAS_WSIGN_COMPARE_FLAG
1413-- Performing Test LIBCXXABI_HAS_WSIGN_COMPARE_FLAG - Success
1414-- Performing Test LIBCXXABI_HAS_WSHADOW_FLAG
1415-- Performing Test LIBCXXABI_HAS_WSHADOW_FLAG - Success
1416-- Performing Test LIBCXXABI_HAS_WCONVERSION_FLAG
1417-- Performing Test LIBCXXABI_HAS_WCONVERSION_FLAG - Success
1418-- Performing Test LIBCXXABI_HAS_WNEWLINE_EOF_FLAG
1419-- Performing Test LIBCXXABI_HAS_WNEWLINE_EOF_FLAG - Failed
1420-- Performing Test LIBCXXABI_HAS_WUNDEF_FLAG
1421-- Performing Test LIBCXXABI_HAS_WUNDEF_FLAG - Success
1422-- Performing Test LIBCXXABI_HAS_PEDANTIC_FLAG
1423-- Performing Test LIBCXXABI_HAS_PEDANTIC_FLAG - Success
1424-- Performing Test LIBCXXABI_HAS_WERROR_FLAG
1425-- Performing Test LIBCXXABI_HAS_WERROR_FLAG - Success
1426-- Performing Test LIBCXXABI_HAS_WNO_ERROR_FLAG
1427-- Performing Test LIBCXXABI_HAS_WNO_ERROR_FLAG - Success
1428-- Performing Test LIBCXXABI_HAS_WX_FLAG
1429-- Performing Test LIBCXXABI_HAS_WX_FLAG - Failed
1430-- Performing Test LIBCXXABI_HAS_NO_WX_FLAG
1431-- Performing Test LIBCXXABI_HAS_NO_WX_FLAG - Failed
1432-- Performing Test LIBCXXABI_HAS_EHSC_FLAG
1433-- Performing Test LIBCXXABI_HAS_EHSC_FLAG - Failed
1434-- Performing Test LIBCXXABI_HAS_NO_EHS_FLAG
1435-- Performing Test LIBCXXABI_HAS_NO_EHS_FLAG - Failed
1436-- Performing Test LIBCXXABI_HAS_NO_EHA_FLAG
1437-- Performing Test LIBCXXABI_HAS_NO_EHA_FLAG - Failed
1438-- Performing Test LIBCXXABI_HAS_NO_GR_FLAG
1439-- Performing Test LIBCXXABI_HAS_NO_GR_FLAG - Failed
1440-- Performing Test LIBCXXABI_HAS_STD_CXX11
1441-- Performing Test LIBCXXABI_HAS_STD_CXX11 - Success
1442-- Looking for fopen in c
1443-- Looking for fopen in c - found
1444-- Looking for dladdr in dl
1445-- Looking for dladdr in dl - found
1446-- Looking for pthread_once in pthread
1447-- Looking for pthread_once in pthread - found
1448-- Looking for __gcc_personality_v0 in gcc_s
1449-- Looking for __gcc_personality_v0 in gcc_s - found
1450-- Looking for __cxa_thread_atexit_impl in c
1451-- Looking for __cxa_thread_atexit_impl in c - found
1452CMake Warning at dios/libcxxabi/CMakeLists.txt:490 (message):
1453  The libc++abi tests aren't valid when libc++abi is built standalone (i.e.
1454  outside of llvm/projects/libcxxabi ) and is built without a shared library.
1455  Either build a shared library, build libc++abi at the same time as you
1456  build libc++, or do without testing.  No check target will be available!
1457
1458
1459-- Looking for fopen in c
1460-- Looking for fopen in c - found
1461-- Looking for __gcc_personality_v0 in gcc_s
1462-- Looking for __gcc_personality_v0 in gcc_s - found
1463-- Performing Test LIBCXX_SUPPORTS_NODEFAULTLIBS_FLAG
1464-- Performing Test LIBCXX_SUPPORTS_NODEFAULTLIBS_FLAG - Success
1465-- Performing Test LIBCXX_HAVE_CXX_ATOMICS_WITHOUT_LIB
1466-- Performing Test LIBCXX_HAVE_CXX_ATOMICS_WITHOUT_LIB - Success
1467-- Looking for __atomic_fetch_add_8 in atomic
1468-- Looking for __atomic_fetch_add_8 in atomic - not found
1469-- Performing Test LIBCXX_HAS_WX_FLAG
1470-- Performing Test LIBCXX_HAS_WX_FLAG - Failed
1471-- Performing Test LIBCXX_HAS_NO_WX_FLAG
1472-- Performing Test LIBCXX_HAS_NO_WX_FLAG - Failed
1473-- Performing Test LIBCXX_HAS_EHSC_FLAG
1474-- Performing Test LIBCXX_HAS_EHSC_FLAG - Failed
1475-- Performing Test LIBCXX_HAS_NO_EHS_FLAG
1476-- Performing Test LIBCXX_HAS_NO_EHS_FLAG - Failed
1477-- Performing Test LIBCXX_HAS_NO_EHA_FLAG
1478-- Performing Test LIBCXX_HAS_NO_EHA_FLAG - Failed
1479-- Performing Test LIBCXX_HAS_NO_GR_FLAG
1480-- Performing Test LIBCXX_HAS_NO_GR_FLAG - Failed
1481-- Looking for pthread_create in pthread
1482-- Looking for pthread_create in pthread - found
1483-- Looking for ccos in m
1484-- Looking for ccos in m - found
1485-- Looking for clock_gettime in rt
1486-- Looking for clock_gettime in rt - found
1487-- Performing Test LIBCXX_SUPPORTS_STD_EQ_CXX11_FLAG
1488-- Performing Test LIBCXX_SUPPORTS_STD_EQ_CXX11_FLAG - Success
1489-- Performing Test LIBCXX_SUPPORTS_NOSTDINCXX_FLAG
1490-- Performing Test LIBCXX_SUPPORTS_NOSTDINCXX_FLAG - Success
1491-- Performing Test LIBCXX_SUPPORTS_FVISIBILITY_INLINES_HIDDEN_FLAG
1492-- Performing Test LIBCXX_SUPPORTS_FVISIBILITY_INLINES_HIDDEN_FLAG - Success
1493-- Performing Test LIBCXX_SUPPORTS_WALL_FLAG
1494-- Performing Test LIBCXX_SUPPORTS_WALL_FLAG - Success
1495-- Performing Test LIBCXX_SUPPORTS_WEXTRA_FLAG
1496-- Performing Test LIBCXX_SUPPORTS_WEXTRA_FLAG - Success
1497-- Performing Test LIBCXX_SUPPORTS_W_FLAG
1498-- Performing Test LIBCXX_SUPPORTS_W_FLAG - Success
1499-- Performing Test LIBCXX_SUPPORTS_WWRITE_STRINGS_FLAG
1500-- Performing Test LIBCXX_SUPPORTS_WWRITE_STRINGS_FLAG - Success
1501-- Performing Test LIBCXX_SUPPORTS_WNO_UNUSED_PARAMETER_FLAG
1502-- Performing Test LIBCXX_SUPPORTS_WNO_UNUSED_PARAMETER_FLAG - Success
1503-- Performing Test LIBCXX_SUPPORTS_WNO_LONG_LONG_FLAG
1504-- Performing Test LIBCXX_SUPPORTS_WNO_LONG_LONG_FLAG - Success
1505-- Performing Test LIBCXX_SUPPORTS_WERROR_EQ_RETURN_TYPE_FLAG
1506-- Performing Test LIBCXX_SUPPORTS_WERROR_EQ_RETURN_TYPE_FLAG - Success
1507-- Performing Test LIBCXX_SUPPORTS_WNO_LITERAL_SUFFIX_FLAG
1508-- Performing Test LIBCXX_SUPPORTS_WNO_LITERAL_SUFFIX_FLAG - Success
1509-- Performing Test LIBCXX_SUPPORTS_WNO_CXX14_COMPAT_FLAG
1510-- Performing Test LIBCXX_SUPPORTS_WNO_CXX14_COMPAT_FLAG - Success
1511-- Performing Test LIBCXX_SUPPORTS_WNO_ERROR_FLAG
1512-- Performing Test LIBCXX_SUPPORTS_WNO_ERROR_FLAG - Success
1513-- Performing Test LIBCXX_SUPPORTS_EHSC_FLAG
1514-- Performing Test LIBCXX_SUPPORTS_EHSC_FLAG - Failed
1515-- Performing Test LIBCXX_SUPPORTS_FPIC_FLAG
1516-- Performing Test LIBCXX_SUPPORTS_FPIC_FLAG - Success
1517-- Performing Test LIBCXX_SUPPORTS_STD_EQ_CXX14_FLAG
1518-- Performing Test LIBCXX_SUPPORTS_STD_EQ_CXX14_FLAG - Success
1519-- Found Perl: /usr/bin/perl (found version "5.28.1")
1520-- Could NOT find ODBC (missing: ODBC_CONFIG_EXECUTABLE ODBC_INCLUDE_DIRS_)
1521-- Found PkgConfig: /usr/bin/pkg-config (found version "1.5.3")
1522-- Could NOT find Z3 (missing: Z3_LIBRARY Z3_INCLUDE_DIR)
1523-- Performing Test BRICKS_HAVE_DIRENT_D_TYPE
1524-- Performing Test BRICKS_HAVE_DIRENT_D_TYPE - Success
1525-- Checking for module 'valgrind'
1526--   Package 'valgrind', required by 'virtual:world', not found
1527CMake Warning at CMakeLists.txt:225 (message):
1528  Valgrind (headers) not found! Pool debugging will not work.
1529
1530
1531-- Configuring done
1532-- Generating done
1533-- Build files have been written to: /home/kdudka/divine-4.1.20/_build.toolchain
1534[1/8] Building C object dios/libunwind/src/CMakeFiles/unwind_objects.dir/UnwindRegistersRestore.S.o
1535../dios/libunwind/src/UnwindRegistersRestore.S:57:75: warning: invoking macro GLUE2 argument 1: empty macro arguments are undefined in ISO C90 [-Wpedantic]
1536 DEFINE_LIBUNWIND_PRIVATE_FUNCTION(_ZN9libunwind16Registers_x86_646jumptoEv)
1537                                                                           ^
1538../dios/libunwind/src/UnwindRegistersRestore.S:57:75: warning: invoking macro GLUE2 argument 1: empty macro arguments are undefined in ISO C90 [-Wpedantic]
1539../dios/libunwind/src/UnwindRegistersRestore.S:57:75: warning: invoking macro GLUE2 argument 1: empty macro arguments are undefined in ISO C90 [-Wpedantic]
1540../dios/libunwind/src/UnwindRegistersRestore.S:57:75: warning: invoking macro GLUE2 argument 1: empty macro arguments are undefined in ISO C90 [-Wpedantic]
1541[3/8] Building C object dios/libunwind/src/CMakeFiles/unwind_objects.dir/UnwindRegistersSave.S.o
1542../dios/libunwind/src/UnwindRegistersSave.S:63:41: warning: invoking macro GLUE2 argument 1: empty macro arguments are undefined in ISO C90 [-Wpedantic]
1543 DEFINE_LIBUNWIND_FUNCTION(unw_getcontext)
1544                                         ^
1545../dios/libunwind/src/UnwindRegistersSave.S:63:41: warning: invoking macro GLUE2 argument 1: empty macro arguments are undefined in ISO C90 [-Wpedantic]
1546../dios/libunwind/src/UnwindRegistersSave.S:63:41: warning: invoking macro GLUE2 argument 1: empty macro arguments are undefined in ISO C90 [-Wpedantic]
1547[5/8] Building C object dios/libunwind/src/CMakeFiles/unwind_objects.dir/UnwindLevel1-gcc-ext.c.o
1548../dios/libunwind/src/UnwindLevel1-gcc-ext.c: In function ‘_Unwind_Backtrace’:
1549../dios/libunwind/src/UnwindLevel1-gcc-ext.c:173:53: warning: type-punning to incomplete type might break strict-aliasing rules [-Wstrict-aliasing]
1550     result = (*callback)((struct _Unwind_Context *)(&cursor), ref);
1551                                                    ~^~~~~~~~
1552[7/8] Building CXX object dios/libunwind/src/CMakeFiles/unwind_objects.dir/libunwind.cpp.o
1553In file included from ../dios/libunwind/src/UnwindCursor.hpp:30,
1554                 from ../dios/libunwind/src/libunwind.cpp:27:
1555../dios/libunwind/src/AddressSpace.hpp: In static member function ‘static int64_t libunwind::LocalAddressSpace::getSLEB128(libunwind::LocalAddressSpace::pint_t&, libunwind::LocalAddressSpace::pint_t)’:
1556../dios/libunwind/src/AddressSpace.hpp:216:25: warning: left shift of negative value [-Wshift-negative-value]
1557     result |= (-1LL) << bit;
1558                         ^~~
1559../dios/libunwind/src/libunwind.cpp: At global scope:
1560../dios/libunwind/src/libunwind.cpp:35:23: warning: type-punning to incomplete type might break strict-aliasing rules [-Wstrict-aliasing]
1561     (unw_addr_space_t)&LocalAddressSpace::sThisAddressSpace;
1562                       ^~~~~~~~~~~~~~~~~~
1563[8/8] Linking CXX static library dios/libunwind/src/libunwind.a
1564[1/22] Building CXX object dios/libcxxabi/src/CMakeFiles/cxxabi_objects.dir/cxa_aux_runtime.cpp.o
1565In file included from ../dios/libcxx/include/stddef.h:40,
1566                 from ../dios/libcxxabi/include/cxxabi.h:18,
1567                 from ../dios/libcxxabi/src/cxa_aux_runtime.cpp:13:
1568../dios/libcxx/include/__config:480:11: note: you may use an inline namespace instead
1569 namespace _LIBCPP_NAMESPACE {
1570           ^~~~~~~~~~~~~~~~~
1571[3/22] Building CXX object dios/libcxxabi/src/CMakeFiles/cxxabi_objects.dir/cxa_default_handlers.cpp.o
1572In file included from ../dios/libcxx/include/stdexcept:45,
1573                 from ../dios/libcxxabi/src/cxa_default_handlers.cpp:12:
1574../dios/libcxx/include/__config:480:11: note: you may use an inline namespace instead
1575 namespace _LIBCPP_NAMESPACE {
1576           ^~~~~~~~~~~~~~~~~
1577[4/22] Building CXX object dios/libcxxabi/src/CMakeFiles/cxxabi_objects.dir/cxa_handlers.cpp.o
1578In file included from ../dios/libcxx/include/stdexcept:45,
1579                 from ../dios/libcxxabi/src/cxa_handlers.cpp:13:
1580../dios/libcxx/include/__config:480:11: note: you may use an inline namespace instead
1581 namespace _LIBCPP_NAMESPACE {
1582           ^~~~~~~~~~~~~~~~~
1583[5/22] Building CXX object dios/libcxxabi/src/CMakeFiles/cxxabi_objects.dir/cxa_unexpected.cpp.o
1584In file included from ../dios/libcxx/include/exception:80,
1585                 from ../dios/libcxxabi/src/cxa_unexpected.cpp:10:
1586../dios/libcxx/include/__config:480:11: note: you may use an inline namespace instead
1587 namespace _LIBCPP_NAMESPACE {
1588           ^~~~~~~~~~~~~~~~~
1589[6/22] Building CXX object dios/libcxxabi/src/CMakeFiles/cxxabi_objects.dir/cxa_guard.cpp.o
1590In file included from ../dios/libcxx/include/stdio.h:102,
1591                 from ../dios/libcxxabi/src/abort_message.h:13,
1592                 from ../dios/libcxxabi/src/cxa_guard.cpp:12:
1593../dios/libcxx/include/__config:480:11: note: you may use an inline namespace instead
1594 namespace _LIBCPP_NAMESPACE {
1595           ^~~~~~~~~~~~~~~~~
1596[8/22] Building CXX object dios/libcxxabi/src/CMakeFiles/cxxabi_objects.dir/cxa_virtual.cpp.o
1597In file included from ../dios/libcxx/include/stddef.h:40,
1598                 from ../dios/libcxxabi/include/cxxabi.h:18,
1599                 from ../dios/libcxxabi/src/cxa_virtual.cpp:10:
1600../dios/libcxx/include/__config:480:11: note: you may use an inline namespace instead
1601 namespace _LIBCPP_NAMESPACE {
1602           ^~~~~~~~~~~~~~~~~
1603[9/22] Building CXX object dios/libcxxabi/src/CMakeFiles/cxxabi_objects.dir/cxa_vector.cpp.o
1604In file included from ../dios/libcxx/include/stddef.h:40,
1605                 from ../dios/libcxxabi/include/cxxabi.h:18,
1606                 from ../dios/libcxxabi/src/cxa_vector.cpp:14:
1607../dios/libcxx/include/__config:480:11: note: you may use an inline namespace instead
1608 namespace _LIBCPP_NAMESPACE {
1609           ^~~~~~~~~~~~~~~~~
1610[10/22] Building CXX object dios/libcxxabi/src/CMakeFiles/cxxabi_objects.dir/cxa_new_delete.cpp.o
1611In file included from ../dios/libcxx/include/new:88,
1612                 from ../dios/libcxxabi/src/cxa_new_delete.cpp:14:
1613../dios/libcxx/include/__config:480:11: note: you may use an inline namespace instead
1614 namespace _LIBCPP_NAMESPACE {
1615           ^~~~~~~~~~~~~~~~~
1616[11/22] Building CXX object dios/libcxxabi/src/CMakeFiles/cxxabi_objects.dir/cxa_exception_storage.cpp.o
1617In file included from ../dios/libcxx/include/exception:80,
1618                 from ../dios/libcxxabi/src/cxa_exception.hpp:17,
1619                 from ../dios/libcxxabi/src/cxa_exception_storage.cpp:14:
1620../dios/libcxx/include/__config:480:11: note: you may use an inline namespace instead
1621 namespace _LIBCPP_NAMESPACE {
1622           ^~~~~~~~~~~~~~~~~
1623[12/22] Building CXX object dios/libcxxabi/src/CMakeFiles/cxxabi_objects.dir/cxa_exception.cpp.o
1624FAILED: dios/libcxxabi/src/CMakeFiles/cxxabi_objects.dir/cxa_exception.cpp.o
1625/usr/bin/g++  -DHAVE___CXA_THREAD_ATEXIT_IMPL -DLIBCXXABI_USE_LLVM_UNWINDER=1 -D_GNU_SOURCE -D_LIBCXXABI_BUILDING_LIBRARY -D__STDC_CONSTANT_MACROS -D__STDC_FORMAT_MACROS -D__STDC_LIMIT_MACROS -I../llvm/include -Illvm/include -I../clang/include -Iclang/include -I../lld/include -Illd/include -I../compiler-rt/include -Icompiler-rt/include -I../dios/libcxxabi/include -I../dios/libunwind/include -I../dios/libunwind/src -I../dios/libcxx/include -Werror=date-time -std=c++11 -Wall -W -Wno-unused-parameter -Wwrite-strings -Wcast-qual -Wno-missing-field-initializers -pedantic -Wno-long-long -Wno-maybe-uninitialized -Wdelete-non-virtual-dtor -Wno-comment -ffunction-sections -fdata-sections -std=c++11 -fstrict-aliasing -O3 -DNDEBUG -DNVALGRIND   -nostdinc++ -Werror=return-type -W -Wall -Wchar-subscripts -Wconversion -Wmissing-braces -Wno-unused-function -Wshadow -Wsign-compare -Wsign-conversion -Wstrict-aliasing=2 -Wstrict-overflow=4 -Wunused-parameter -Wunused-variable -Wwrite-strings -Wundef -Wno-error -pedantic -D_DEBUG -UNDEBUG -fPIC -std=gnu++11 -MD -MT dios/libcxxabi/src/CMakeFiles/cxxabi_objects.dir/cxa_exception.cpp.o -MF dios/libcxxabi/src/CMakeFiles/cxxabi_objects.dir/cxa_exception.cpp.o.d -o dios/libcxxabi/src/CMakeFiles/cxxabi_objects.dir/cxa_exception.cpp.o -c ../dios/libcxxabi/src/cxa_exception.cpp
1626../dios/libcxxabi/src/cxa_exception.cpp:14:10: fatal error: dios.h: No such file or directory
1627 #include <dios.h>
1628          ^~~~~~~~
1629compilation terminated.
1630[13/22] Building CXX object dios/libcxxabi/src/CMakeFiles/cxxabi_objects.dir/stdlib_exception.cpp.o
1631In file included from ../dios/libcxx/include/exception:80,
1632                 from ../dios/libcxxabi/src/stdlib_exception.cpp:10:
1633../dios/libcxx/include/__config:480:11: note: you may use an inline namespace instead
1634 namespace _LIBCPP_NAMESPACE {
1635           ^~~~~~~~~~~~~~~~~
1636[14/22] Building CXX object dios/libcxxabi/src/CMakeFiles/cxxabi_objects.dir/abort_message.cpp.o
1637In file included from ../dios/libcxx/include/stdlib.h:88,
1638                 from ../dios/libcxxabi/src/abort_message.cpp:10:
1639../dios/libcxx/include/__config:480:11: note: you may use an inline namespace instead
1640 namespace _LIBCPP_NAMESPACE {
1641           ^~~~~~~~~~~~~~~~~
1642[15/22] Building CXX object dios/libcxxabi/src/CMakeFiles/cxxabi_objects.dir/stdlib_typeinfo.cpp.o
1643In file included from ../dios/libcxx/include/typeinfo:60,
1644                 from ../dios/libcxxabi/src/stdlib_typeinfo.cpp:10:
1645../dios/libcxx/include/__config:480:11: note: you may use an inline namespace instead
1646 namespace _LIBCPP_NAMESPACE {
1647           ^~~~~~~~~~~~~~~~~
1648[16/22] Building CXX object dios/libcxxabi/src/CMakeFiles/cxxabi_objects.dir/fallback_malloc.cpp.o
1649In file included from ../dios/libcxx/include/cstddef:36,
1650                 from ../dios/libcxxabi/src/fallback_malloc.h:13,
1651                 from ../dios/libcxxabi/src/fallback_malloc.cpp:10:
1652../dios/libcxx/include/__config:480:11: note: you may use an inline namespace instead
1653 namespace _LIBCPP_NAMESPACE {
1654           ^~~~~~~~~~~~~~~~~
1655[17/22] Building CXX object dios/libcxxabi/src/CMakeFiles/cxxabi_objects.dir/cxa_thread_atexit.cpp.o
1656In file included from ../dios/libcxx/include/stdio.h:102,
1657                 from ../dios/libcxxabi/src/abort_message.h:13,
1658                 from ../dios/libcxxabi/src/cxa_thread_atexit.cpp:10:
1659../dios/libcxx/include/__config:480:11: note: you may use an inline namespace instead
1660 namespace _LIBCPP_NAMESPACE {
1661           ^~~~~~~~~~~~~~~~~
1662[18/22] Building CXX object dios/libcxxabi/src/CMakeFiles/cxxabi_objects.dir/stdlib_stdexcept.cpp.o
1663In file included from ../dios/libcxx/include/__refstring:13,
1664                 from ../dios/libcxxabi/src/stdlib_stdexcept.cpp:10:
1665../dios/libcxx/include/__config:480:11: note: you may use an inline namespace instead
1666 namespace _LIBCPP_NAMESPACE {
1667           ^~~~~~~~~~~~~~~~~
1668[19/22] Building CXX object dios/libcxxabi/src/CMakeFiles/cxxabi_objects.dir/cxa_personality.cpp.o
1669In file included from ../dios/libcxx/include/stdlib.h:88,
1670                 from ../dios/libcxxabi/src/cxa_personality.cpp:16:
1671../dios/libcxx/include/__config:480:11: note: you may use an inline namespace instead
1672 namespace _LIBCPP_NAMESPACE {
1673           ^~~~~~~~~~~~~~~~~
1674../dios/libcxxabi/src/cxa_personality.cpp:195:33: warning: ‘annotate’ attribute directive ignored [-Wattributes]
1675 readULEB128(const uint8_t** data)
1676                                 ^
1677../dios/libcxxabi/src/cxa_personality.cpp:219:33: warning: ‘annotate’ attribute directive ignored [-Wattributes]
1678 readSLEB128(const uint8_t** data)
1679                                 ^
1680../dios/libcxxabi/src/cxa_personality.cpp:466:80: warning: ‘annotate’ attribute directive ignored [-Wattributes]
1681                          void* adjustedPtr, _Unwind_Exception* unwind_exception)
1682                                                                                ^
1683../dios/libcxxabi/src/cxa_personality.cpp:567:49: warning: ‘annotate’ attribute directive ignored [-Wattributes]
1684                         _Unwind_Context *context) {
1685                                                 ^
1686../dios/libcxxabi/src/cxa_personality.cpp:955:83: warning: ‘annotate’ attribute directive ignored [-Wattributes]
1687                      _Unwind_Exception* unwind_exception, _Unwind_Context* context)
1688                                                                                   ^
1689[20/22] Building CXX object dios/libcxxabi/src/CMakeFiles/cxxabi_objects.dir/private_typeinfo.cpp.o
1690In file included from ../dios/libcxx/include/typeinfo:60,
1691                 from ../dios/libcxxabi/src/private_typeinfo.h:15,
1692                 from ../dios/libcxxabi/src/private_typeinfo.cpp:10:
1693../dios/libcxx/include/__config:480:11: note: you may use an inline namespace instead
1694 namespace _LIBCPP_NAMESPACE {
1695           ^~~~~~~~~~~~~~~~~
1696[21/22] Building CXX object dios/libcxxabi/src/CMakeFiles/cxxabi_objects.dir/cxa_demangle.cpp.o
1697In file included from ../dios/libcxx/include/vector:264,
1698                 from ../dios/libcxxabi/src/cxa_demangle.cpp:15:
1699../dios/libcxx/include/__config:480:11: note: you may use an inline namespace instead
1700 namespace _LIBCPP_NAMESPACE {
1701           ^~~~~~~~~~~~~~~~~
1702../dios/libcxxabi/src/cxa_demangle.cpp: In function ‘const char* __cxxabiv1::{anonymous}::parse_type(const char*, const char*, C&) [with C = __cxxabiv1::{anonymous}::Db]’:
1703../dios/libcxxabi/src/cxa_demangle.cpp:2216:25: warning: this statement may fall through [-Wimplicit-fallthrough=]
1704                         if (first+1 != last)
1705                         ^~
1706../dios/libcxxabi/src/cxa_demangle.cpp:2261:21: note: here
1707                     default:
1708                     ^~~~~~~
1709ninja: build stopped: subcommand failed.
1710make[1]: *** [Makefile:131: /home/kdudka/divine-4.1.20/_build.toolchain/stamp-v5] Error 1
1711make: *** [Makefile:73: release] Error 2