Ticket #75: fedora-30-no-ninja-4.3.4.txt

File fedora-30-no-ninja-4.3.4.txt, 1.6 KB (added by Lukáš Zaoral, 3 years ago)
Line 
1Scanning dependencies of target divine-vm
2[  3%] Building CXX object divine/CMakeFiles/divine-vm.dir/vm/constants.cpp.o
3[  3%] Building CXX object divine/CMakeFiles/divine-vm.dir/vm/eval.cpp.o
4In file included from /root/divine-4.3.4/divine/vm/eval.cpp:23:
5In file included from /root/divine-4.3.4/divine/vm/t-eval.hpp:22:
6In file included from /root/divine-4.3.4/divine/vm/t-program.hpp:23:
7In file included from /root/divine-4.3.4/divine/cc/cc1.hpp:21:
8In file included from /root/divine-4.3.4/divine/cc/vfs.hpp:21:
9In file included from /root/divine-4.3.4/clang/include/clang/Tooling/Tooling.h:37:
10In file included from /root/divine-4.3.4/clang/include/clang/Frontend/FrontendAction.h:24:
11In file included from /root/divine-4.3.4/clang/include/clang/Frontend/ASTUnit.h:18:
12In file included from /root/divine-4.3.4/clang/include/clang/AST/ASTContext.h:18:
13In file included from /root/divine-4.3.4/clang/include/clang/AST/ASTTypeTraits.h:19:
14/root/divine-4.3.4/clang/include/clang/AST/ASTFwd.h:22:10: fatal error: 'clang/AST/DeclNodes.inc' file
15      not found
16#include "clang/AST/DeclNodes.inc"
17         ^~~~~~~~~~~~~~~~~~~~~~~~~
181 error generated.
19gmake[6]: *** [divine/CMakeFiles/divine-vm.dir/build.make:76: divine/CMakeFiles/divine-vm.dir/vm/eval.cpp.o] Error 1
20gmake[5]: *** [CMakeFiles/Makefile2:27992: divine/CMakeFiles/divine-vm.dir/all] Error 2
21gmake[4]: *** [CMakeFiles/Makefile2:28512: tools/CMakeFiles/divine.dir/rule] Error 2
22gmake[3]: *** [Makefile:8428: divine] Error 2
23make[2]: *** [Makefile:102: build] Error 2
24make[1]: *** [Makefile:119: release-divine] Error 2
25make: *** [Makefile:75: release] Error 2
26